{"text_format":"1","workbook":"xlsx","n_sheets":11,"sheets":["Version History","Lookup","Content & Approval","ICARD","Latitude & Longitude","ENR 2 Temp","ENR 3 Temp","ENR 5.1 Temp","AD 2.17 Temp","Other Airspace Temp","Metadata"],"not_rendered":{"charts":0,"images":2,"macros":1,"external_links":0,"defined_names":20,"comments":9,"pivot_tables":0},"unopened":[],"bounds":{"document_bytes":16777216,"sheet_cells":100000,"rows_first":2000,"rows_last":500,"rows_between":2000,"halvings":0,"cell_chars":16384,"cell_head_chars":4096},"cells_cut":0,"cells_raw":0,"read":"whole","date_system":"1900"}

{"sheet":"Version History","index":0,"n_rows":37,"n_cols":2,"rows_kept":37,"cut":false,"hidden":true,"merged":[]}
["Date","Issue Updates"]
[null,"UAT"]
["2018-12-20","Textual amendments\nFormatting\n"]
["2019-01-15","Protection of macros/restricting unprotect\nDuplicate sheets not keeping protection\nDuplicate sheets losing functionality\nRoute/Airspace Name Cell has larger text\nRows (not columns) can now be extended downwards in AIP templates\n"]
["2019-02-11","Cells Wrapped to improve legibility\nRows (not columns) can now be extended downwards in Lat/Long Sheet\nFormatting issues on longitude field corrected.\nAdditional column added for Hours of Applicability AD 2.17\nTracks and Distance values now held to 5dp\nAD 2.17/ENR 5.1 – drop-down list extended in Column E\nAD 2.17 minor formatting to columns F-I\nText on metadata sheet\nIssue dates/details added - versioning removed to avoid confusion with submitted version\n"]
["2019-06-20","Additional Rows Added to Track & Distance sheet. Resulting Drop down list re-formatted.\nAll sheets now permit formatting of rows/columns/cells.\nMetadata sheet re-formatted."]
["2019-07-01","Tab Navigation and cross reference added.\nContent page re-formatted.\nENR sheets lookup range extended."]
["2019-07-23","No Design Content' option incorporated in metadata.\nLook up list ranges extended for ENR2.1 and associated templates."]
{"$rows_left_out":30}
{"sheet":"Lookup","index":1,"n_rows":36,"n_cols":8,"rows_kept":36,"cut":false,"hidden":true,"merged":[]}
[null,"Feature","DAL","UK Accuracy Required"]
[null,"5LNC Significant Point",2,"30m",1,1.1000000000000001,"Calculated","thence clockwise by arc of a circle #NM/M radius centred on:"]
[null,"AIAA",2,"30m",2,2.1,"Visual","thence anti-clockwise by arc of a circle #NM/M radius centred on:"]
[null,"ATS Airspace Fillet",2,"30m",3,3.1,"Published AIP","Circle #NM/M radius:"]
[null,"ATS or Upper ATS Route",2,"30m",4,4.0999999999999996,"Surveyed","Along coastline to:"]
[null,"ATS RNAV Route",2,"30m",5,5.0999999999999996,"Declared"]
[null,"ATZ",2,"30m",6,6.1]
[null,"CTA",2,"30m",7,7.1]
{"$rows_left_out":29}
{"sheet":"Content & Approval","index":2,"n_rows":51,"n_cols":18,"rows_kept":51,"cut":false,"hidden":false,"merged":[[11,0,12,0],[13,0,17,0],[21,1,21,11],[7,2,7,3],[11,17,16,19],[1,15,17,15],[22,1,48,11],[8,2,8,3],[1,2,5,6]]}
[]
[null,null,null,null,null,null,null,null,null,null,null,null,null,null,null,"Click + to show/hide guidance notes >"]
[]
[]
[]
[]
[]
[null,"Enter ACP Ref:","Enter Name of Airspace Change Project:",null,"Submitted Vers.","Regulated Vers.","Overall Approval",null,null,null,null,null,null,"Cell input Guidance:"]
{"$rows_left_out":44}
{"sheet":"ICARD","index":3,"n_rows":205,"n_cols":11,"rows_kept":205,"cut":false,"hidden":true,"merged":[]}
[]
[null,null,null,"ICARD Reservation Requests",null,null,null,null,null,{"$f":"\"A total of \"&COUNTIF(J5:J204,\"YES\")","v":"A total of 0"}]
[null,null,null,null,null,null,null,null,null,{"$f":"COUNTIF(J5:J204,\"YES\")","v":0}]
[null,"Working Name of 5LNC","ICARD Requested 5LNC","ICARD Description","ICARD Proximity Latitude used","ICARD Proximity Longitude used","Reserved ICARD 5LNC","ICARD Submission Date","ICARD Approval Date","CAA issues to resolve?","Additional CAA Comments"]
[]
[]
[]
[]
{"$rows_left_out":198}
{"sheet":"Latitude & Longitude","index":4,"n_rows":205,"n_cols":43,"rows_kept":205,"cut":false,"hidden":false,"merged":[]}
[]
[null,null,"  ","Latitude & Longitude",null,null,null,"a Paste a",null,"x Paste x",null,"a Paste a",null,"x Paste x",null,{"$f":"\"A total of \"&COUNTIF(P5:P204,\"Yes\")","v":"A total of 0"},null,null,null,null,null,null,null,null,null,null,null,null,null,null,null,null,null,null,null,null,null,null,null,null,null,"from h5","from L5"]
[null,null,null,null,null,null,null,null,null,null,null,null,null,null,null,{"$f":"COUNTIF(P5:P204,\"Yes\")","v":0}]
[null,"Name of Point","Primary Airspace Usage","DAL ","UK Accuracy ","Origination Type","Point Origination Description","Latitude","format","Latitude\nDouble Check","match","Longitude","format","Longitude\nDouble Check","match","CAA issues to resolve?","Additional CAA Comments","Breakdown of DEG","Error DEG","Breakdown of MIN","Error MIN","Breakdown of SEC (1)","Error SEC 1","LENTH of LAT","LENGTH OF LAT ERROR","Breakdown of Hemisphere","Error Hemisphere","Total Lat Error",null,"Breakdown of DEG","Error Deg","Breakdown of MIN","Error Min","Breakdown of SEC","Error SEC","Breakdown of meridian","Error meridian","LENGTH of LONG","LENGTH of LONG ERROR","Total Long Error",null,"Google Earth Lat","Google Earth Long"]
[null,null,null,{"$f":"IF(C5=\"\",\"\",VLOOKUP($C5,Lookup!$B$2:$E$49,2,FALSE))","v":""},{"$f":"IF(C5=\"\",\"\",VLOOKUP($C5,Lookup!$B$2:$E$49,3,FALSE))","v":""},null,null,null,{"$f":"IF(H5=\"\",\"\",IF(AB5+0>0,\"r\",IF(AB5+0=0,\"a\",\"\")))","v":""},null,{"$f":"IF(H5=\"\",\"\",IF(H5=J5,\"a\",\"r\"))","v":""},null,{"$f":"IF(L5=\"\",\"\",IF(AN5+0>0,\"r\",IF(AN5+0=0,\"a\",\"\")))","v":""},null,{"$f":"IF(L5=\"\",\"\",IF(L5=N5,\"a\",\"r\"))","v":""},null,null,{"$f":"IF(H5=\"\",\"\",LEFT(H5,2)+0)","v":""},{"$f":"IF(H5=\"\",\"0\",IF(AND(R5>=40,R5<=70),\"0\",\"1\"))","v":"0"},{"$f":"IF(H5=\"\",\"\",MID(H5,3,2)+0)","v":""},{"$f":"IF(H5=\"\",\"0\",IF(T5>59,\"1\",\"0\"))","v":"0"},{"$f":"IF(H5=\"\",\"\",MID(H5,5,5)+0)","v":""},{"$f":"IFERROR(V5>60,\"1\")","v":true},{"$f":"LEN(H5)","v":0},{"$f":"IF(X5<10,\"1\",\"0\")","v":"1"},{"$f":"RIGHT(H5,1)","v":""},{"$f":"IF(Z5=\"\",\"0\",IF(Z5=\"N\",\"0\",\"1\"))","v":"0"},{"$f":"S5+U5++Y5+W5+AA5","v":2},null,{"$f":"IF(L5=\"\",\"\",LEFT(L5,3)+0)","v":""},{"$f":"IF(L5=\"\",\"0\",IF(AD5>20,\"1\",\"0\"))","v":"0"},{"$f":"IF(L5=\"\",\"\",MID(L5,4,2)+0)","v":""},{"$f":"IF(L5=\"\",\"0\",IF(AF5>59,\"1\",\"0\"))","v":"0"},{"$f":"IF(L5=\"\",\"\",MID(L5,6,5)+0)","v":""},{"$f":"IFERROR(AH5>60,\"1\")","v":true},{"$f":"RIGHT(L5,1)","v":""},{"$f":"IF(L5=\"\",\"0\",IF(AJ5=\"W\",\"0\",IF(AJ5=\"E\",\"0\",\"1\")))","v":"0"},{"$f":"LEN(L5)","v":0},{"$f":"IF(AL5<11,\"1\",\"0\")","v":"1"},{"$f":"AE5+AG5+AI5+AK5+AM5","v":2},null,{"$f":"LEFT(H5,2)&\" \"& MID(H5,3,2)&\" \"&MID(H5,5,10)","v":"  "},{"$f":"LEFT(L5,3)&\" \"& MID(L5,4,2)&\" \"&MID(L5,6,10)","v":"  "}]
[null,null,null,{"$f":"IF(C6=\"\",\"\",VLOOKUP($C6,Lookup!$B$2:$E$49,2,FALSE))","v":""},{"$f":"IF(C6=\"\",\"\",VLOOKUP($C6,Lookup!$B$2:$E$49,3,FALSE))","v":""},null,null,null,{"$f":"IF(H6=\"\",\"\",IF(AB6+0>0,\"r\",IF(AB6+0=0,\"a\",\"\")))","v":""},null,{"$f":"IF(H6=\"\",\"\",IF(H6=J6,\"a\",\"r\"))","v":""},null,{"$f":"IF(L6=\"\",\"\",IF(AN6+0>0,\"r\",IF(AN6+0=0,\"a\",\"\")))","v":""},null,{"$f":"IF(L6=\"\",\"\",IF(L6=N6,\"a\",\"r\"))","v":""},null,null,{"$f":"IF(H6=\"\",\"\",LEFT(H6,2)+0)","v":""},{"$f":"IF(H6=\"\",\"0\",IF(AND(R6>=40,R6<=70),\"0\",\"1\"))","v":"0"},{"$f":"IF(H6=\"\",\"\",MID(H6,3,2)+0)","v":""},{"$f":"IF(H6=\"\",\"0\",IF(T6>59,\"1\",\"0\"))","v":"0"},{"$f":"IF(H6=\"\",\"\",MID(H6,5,5)+0)","v":""},{"$f":"IFERROR(V6>60,\"1\")","v":true},{"$f":"LEN(H6)","v":0},{"$f":"IF(X6<10,\"1\",\"0\")","v":"1"},{"$f":"RIGHT(H6,1)","v":""},{"$f":"IF(Z6=\"\",\"0\",IF(Z6=\"N\",\"0\",\"1\"))","v":"0"},{"$f":"S6+U6++Y6+W6+AA6","v":2},null,{"$f":"IF(L6=\"\",\"\",LEFT(L6,3)+0)","v":""},{"$f":"IF(L6=\"\",\"0\",IF(AD6>20,\"1\",\"0\"))","v":"0"},{"$f":"IF(L6=\"\",\"\",MID(L6,4,2)+0)","v":""},{"$f":"IF(L6=\"\",\"0\",IF(AF6>59,\"1\",\"0\"))","v":"0"},{"$f":"IF(L6=\"\",\"\",MID(L6,6,5)+0)","v":""},{"$f":"IFERROR(AH6>60,\"1\")","v":true},{"$f":"RIGHT(L6,1)","v":""},{"$f":"IF(L6=\"\",\"0\",IF(AJ6=\"W\",\"0\",IF(AJ6=\"E\",\"0\",\"1\")))","v":"0"},{"$f":"LEN(L6)","v":0},{"$f":"IF(AL6<11,\"1\",\"0\")","v":"1"},{"$f":"AE6+AG6+AI6+AK6+AM6","v":2},null,{"$f":"LEFT(H6,2)&\" \"& MID(H6,3,2)&\" \"&MID(H6,5,10)","v":"  "},{"$f":"LEFT(L6,3)&\" \"& MID(L6,4,2)&\" \"&MID(L6,6,10)","v":"  "}]
[null,null,null,{"$f":"IF(C7=\"\",\"\",VLOOKUP($C7,Lookup!$B$2:$E$49,2,FALSE))","v":""},{"$f":"IF(C7=\"\",\"\",VLOOKUP($C7,Lookup!$B$2:$E$49,3,FALSE))","v":""},null,null,null,"",null,"",null,"",null,"",null,null,"","0","","0","",true,0,"1","","0",2,null,"","0","","0","",true,"","0",0,"1",2,null,"  ","  "]
[null,null,null,{"$f":"IF(C8=\"\",\"\",VLOOKUP($C8,Lookup!$B$2:$E$49,2,FALSE))","v":""},{"$f":"IF(C8=\"\",\"\",VLOOKUP($C8,Lookup!$B$2:$E$49,3,FALSE))","v":""},null,null,null,"",null,"",null,"",null,"",null,null,"","0","","0","",true,0,"1","","0",2,null,"","0","","0","",true,"","0",0,"1",2,null,"  ","  "]
{"$rows_left_out":198}
{"sheet":"ENR 2 Temp","index":5,"n_rows":58,"n_cols":12,"rows_kept":58,"cut":false,"hidden":true,"merged":[[4,1,5,1],[4,10,5,10],[4,11,5,11],[6,2,6,3],[7,6,54,6],[7,7,54,7],[7,8,54,8],[7,9,54,9],[1,3,1,4],[1,6,1,8],[1,9,1,11],[2,1,2,2],[2,3,2,4],[2,6,2,8],[2,9,2,11]]}
[]
[null,"1a. ENR Section:",null,"1b. Name of Airspace:",null,null,{"$f":"\"2a. Partial or complete description of \"&D3&\":\"","v":"2a. Partial or complete description of :"},null,null,{"$f":"IF(G3=\"Partial\",\"2b. Describe parts of \"&D3&\" not included in this entry (therefore assumed unchanged):\",\"2b. N/A\")","v":"2b. N/A"}]
[]
[]
[null,"\n\n\n\n\n",{"$f":"IF(B3=\"\",\"\",B3)","v":""},null,null,null,null,null,null,null,{"$f":"\"A total of \"&COUNTIF(K8:K56,\"Yes\")","v":"A total of 0"}]
[null,null,"Only one named airspace per worksheet - additional sheets are added via the Content and Approval tab. "]
[null,"Select points below in publication order (Origin North/West & Clockwise)",{"$f":"\"Name\nLateral Lmits\nVertical Limits\nClass of Airspace\n\"&D3","v":"Name\nLateral Lmits\nVertical Limits\nClass of Airspace\n"},null,"Optional 1.\nTextual description to describe join type. Great circle line assumed if blank","Optional 2. Radius of arc","Unit Providing Service","Callsign\nLanguage\nHours of Service\nConditions of Use","Frequency MHz/\nChannel Purpose/\nSATVOICE\nnumber","Remarks","CAA\nissues to resolve?","Additional CAA Comments"]
[null,null,{"$f":"IF(B8=\"\",\"\",IFERROR(VLOOKUP($B8,'Latitude & Longitude'!$B$5:$L$1001,7,FALSE),\"No Change\"))","v":""},{"$f":"IF(B8=\"\",\"\",IFERROR(VLOOKUP($B8,'Latitude & Longitude'!$B$5:$L$1001,11,FALSE),\"No Change\"))","v":""}]
{"$rows_left_out":51}
{"sheet":"ENR 3 Temp","index":6,"n_rows":207,"n_cols":16,"rows_kept":207,"cut":false,"hidden":true,"merged":[[209,2,209,3],[205,2,205,3],[206,4,206,5],[206,8,208,8],[207,1,208,1],[207,2,208,2],[207,3,208,3],[207,4,208,4],[201,2,201,3],[202,4,202,5],[202,8,204,8],[203,1,204,1],[203,2,204,2],[203,3,204,3],[203,4,204,4],[199,3,200,3],[199,4,200,4],[193,2,193,3],[194,4,194,5],[194,8,196,8],[195,1,196,1],[195,2,196,2],[195,3,196,3],[195,4,196,4],[197,2,197,3],[198,4,198,5],[198,8,200,8],[199,1,200,1],[199,2,200,2],[189,2,189,3],[190,4,190,5],[190,8,192,8],[191,1,192,1],[191,2,192,2],[191,3,192,3],[191,4,192,4],[185,2,185,3],[186,4,186,5],[186,8,188,8],[187,1,188,1],[187,2,188,2],[187,3,188,3],[187,4,188,4],[181,2,181,3],[182,4,182,5],[182,8,184,8],[183,1,184,1],[183,2,184,2],[183,3,184,3],[183,4,184,4],[177,2,177,3],[178,4,178,5],[178,8,180,8],[179,1,180,1],[179,2,180,2],[179,3,180,3],[179,4,180,4],[173,2,173,3],[174,4,174,5],[174,8,176,8],[175,1,176,1],[175,2,176,2],[175,3,176,3],[175,4,176,4],[169,2,169,3],[170,4,170,5],[170,8,172,8],[171,1,172,1],[171,2,172,2],[171,3,172,3],[171,4,172,4],[165,2,165,3],[166,4,166,5],[166,8,168,8],[167,1,168,1],[167,2,168,2],[167,3,168,3],[167,4,168,4],[161,2,161,3],[162,4,162,5],[162,8,164,8],[163,1,164,1],[163,2,164,2],[163,3,164,3],[163,4,164,4],[157,2,157,3],[158,4,158,5],[158,8,160,8],[159,1,160,1],[159,2,160,2],[159,3,160,3],[159,4,160,4],[153,2,153,3],[154,4,154,5],[154,8,156,8],[155,1,156,1],[155,2,156,2],[155,3,156,3],[155,4,156,4],[149,2,149,3],[150,4,150,5],[150,8,152,8],[151,1,152,1],[151,2,152,2],[151,3,152,3],[151,4,152,4],[145,2,145,3],[146,4,146,5],[146,8,148,8],[147,1,148,1],[147,2,148,2],[147,3,148,3],[147,4,148,4],[141,2,141,3],[142,4,142,5],[142,8,144,8],[143,1,144,1],[143,2,144,2],[143,3,144,3],[143,4,144,4],[137,2,137,3],[138,4,138,5],[138,8,140,8],[139,1,140,1],[139,2,140,2],[139,3,140,3],[139,4,140,4],[133,2,133,3],[134,4,134,5],[134,8,136,8],[135,1,136,1],[135,2,136,2],[135,3,136,3],[135,4,136,4],[129,2,129,3],[130,4,130,5],[130,8,132,8],[131,1,132,1],[131,2,132,2],[131,3,132,3],[131,4,132,4],[125,2,125,3],[126,4,126,5],[126,8,128,8],[127,1,128,1],[127,2,128,2],[127,3,128,3],[127,4,128,4],[121,2,121,3],[122,4,122,5],[122,8,124,8],[123,1,124,1],[123,2,124,2],[123,3,124,3],[123,4,124,4],[117,2,117,3],[118,4,118,5],[118,8,120,8],[119,1,120,1],[119,2,120,2],[119,3,120,3],[119,4,120,4],[113,2,113,3],[114,4,114,5],[114,8,116,8],[115,1,116,1],[115,2,116,2],[115,3,116,3],[115,4,116,4],[109,2,109,3],[110,4,110,5],[110,8,112,8],[111,1,112,1],[111,2,112,2],[111,3,112,3],[111,4,112,4],[105,2,105,3],[106,4,106,5],[106,8,108,8],[107,1,108,1],[107,2,108,2],[107,3,108,3],[107,4,108,4],[101,2,101,3],[102,4,102,5],[102,8,104,8],[103,1,104,1],[103,2,104,2],[103,3,104,3],[103,4,104,4],[97,2,97,3],[98,4,98,5],[98,8,100,8],[99,1,100,1],[99,2,100,2],[99,3,100,3],[99,4,100,4],[93,2,93,3],[94,4,94,5],[94,8,96,8],[95,1,96,1],[95,2,96,2],[95,3,96,3],[95,4,96,4],[89,2,89,3],[90,4,90,5],[90,8,92,8],[91,1,92,1],[91,2,92,2],[91,3,92,3],[91,4,92,4],[85,2,85,3],[86,4,86,5],[86,8,88,8],[87,1,88,1],[87,2,88,2],[87,3,88,3],[87,4,88,4],[81,2,81,3],[82,4,82,5],[82,8,84,8],[83,1,84,1],[83,2,84,2],[83,3,84,3],[83,4,84,4],[77,2,77,3],[78,4,78,5],[78,8,80,8],[79,1,80,1],[79,2,80,2],[79,3,80,3],[79,4,80,4],[73,2,73,3],[74,4,74,5],[74,8,76,8],[75,1,76,1],[75,2,76,2],[75,3,76,3],[75,4,76,4],[69,2,69,3],[70,4,70,5],[70,8,72,8],[71,1,72,1],[71,2,72,2],[71,3,72,3],[71,4,72,4],[65,2,65,3],[66,4,66,5],[66,8,68,8],[67,1,68,1],[67,2,68,2],[67,3,68,3],[67,4,68,4],[61,2,61,3],[62,4,62,5],[62,8,64,8],[63,1,64,1],[63,2,64,2],[63,3,64,3],[63,4,64,4],[57,2,57,3],[58,4,58,5],[58,8,60,8],[59,1,60,1],[59,2,60,2],[59,3,60,3],[59,4,60,4],[53,2,53,3],[54,4,54,5],[54,8,56,8],[55,1,56,1],[55,2,56,2],[55,3,56,3],[55,4,56,4],[49,2,49,3],[50,4,50,5],[50,8,52,8],[51,1,52,1],[51,2,52,2],[51,3,52,3],[51,4,52,4],[45,2,45,3],[46,4,46,5],[46,8,48,8],[47,1,48,1],[47,2,48,2],[47,3,48,3],[47,4,48,4],[41,2,41,3],[42,4,42,5],[42,8,44,8],[43,1,44,1],[43,2,44,2],[43,3,44,3],[43,4,44,4],[37,2,37,3],[38,4,38,5],[38,8,40,8],[39,1,40,1],[39,2,40,2],[39,3,40,3],[39,4,40,4],[33,2,33,3],[34,4,34,5],[34,8,36,8],[35,1,36,1],[35,2,36,2],[35,3,36,3],[35,4,36,4],[29,2,29,3],[30,4,30,5],[30,8,32,8],[31,1,32,1],[31,2,32,2],[31,3,32,3],[31,4,32,4],[25,2,25,3],[26,4,26,5],[26,8,28,8],[27,1,28,1],[27,2,28,2],[27,3,28,3],[27,4,28,4],[21,2,21,3],[22,4,22,5],[22,8,24,8],[23,1,24,1],[23,2,24,2],[23,3,24,3],[23,4,24,4],[17,2,17,3],[18,4,18,5],[18,8,20,8],[19,1,20,1],[19,2,20,2],[19,3,20,3],[19,4,20,4],[14,4,14,5],[14,8,16,8],[15,1,16,1],[15,2,16,2],[15,3,16,3],[15,4,16,4],[11,1,12,1],[11,2,12,2],[11,3,12,3],[11,4,12,4],[4,9,5,9],[4,10,5,10],[10,8,12,8],[1,2,1,3],[4,1,5,1],[10,4,10,5],[7,2,7,3],[13,2,13,3],[2,2,2,3],[6,2,6,8],[8,2,8,3],[8,6,8,7],[7,5,7,8],[2,5,2,8],[1,9,1,10],[2,9,2,10],[9,6,9,7]]}
[null,null,null,null,null,null,null,null,null,null,null,null,null,"All_FLs","Odd_FLs","Even_FLs"]
[null,"1a. ENR Section:","1b. Name of Route:",null,null,{"$f":"\"2a. Partial or complete description of \"&C3&\":\"","v":"2a. Partial or complete description of :"},null,null,null,{"$f":"IF(F3=\"Partial\",\"2b. Describe parts of \"&C3&\" not included in this entry (therefore assumed unchanged):\",\"2b. N/A\")","v":"2b. N/A"},null,null,"Select FL:","Odd","Even"]
[null,null,null,null,null,null,null,null,null,null,null,null,"FL 5","Select Odd FL:","Select Even FL"]
[null,null,null,null,null,null,null,null,null,null,null,null,null,"FL 35","FL 50","FL 40"]
[null,null,{"$f":"IF(B3=\"\",\"\",B3)","v":""},null,null,null,"Note: Ensure route is listed south-north",null,null,{"$f":"\"A total of \"&COUNTIF(J10:J209,\"Yes\")","v":"A total of 0"},null,null,null,"FL 40","FL 70","FL 60"]
[null,null,"Only one named airspace per worksheet - additional sheets are added via the Content and Approval tab. ",null,null,null,null,null,null,null,null,null,null,"FL 45","FL 90","FL 80"]
[null,"Route Designator\n(RNP/RNAV Type)",null,null,null,null,null,null,null,"CAA issues to resolve?","Additional CAA Comments",null,null,"FL 50","FL 110","FL 100"]
["∆","Significant Point Name \n","Significant Point Coordinates\n",null,null,"Waypoint: Ident of VOR/DME\nBRG, DIST & ELEV of DME antenna",null,null,null,null,null,null,null,"FL 55","FL 130","FL 120"]
{"$rows_left_out":200}
{"sheet":"ENR 5.1 Temp","index":7,"n_rows":33,"n_cols":10,"rows_kept":33,"cut":false,"hidden":true,"merged":[[6,2,6,3],[7,6,31,6],[7,7,31,7],[0,12,0,13],[1,7,1,9],[2,1,2,2],[2,4,2,5],[2,7,2,9],[4,1,5,1],[4,8,5,8],[4,9,5,9],[5,2,5,7]]}
[]
[null,"1. Name of Airspace:",null,null,{"$f":"\"2a. Partial or complete description of \"&B3&\":\"","v":"2a. Partial or complete description of :"},null,null,{"$f":"IF(E3=\"Partial\",\"2b. Please describe parts of \"&B3&\" not included in this entry, therefore assumed unchanged:\",\"2b. N/A\")","v":"2b. N/A"}]
[]
[]
[null,"\n\n\n\n\n","ENR 5.1 PROHIBITED, RESTRICTED AND DANGER AREAS (Including RU)",null,null,null,null,null,{"$f":"\"A total of \"&COUNTIF(I8:I32,\"Yes\")","v":"A total of 0"}]
[null,null,"Only one named airspace per worksheet - additional sheets are added via the Content and Approval tab. "]
[null,"Select points below in publication order (Origin North/West & Clockwise)",{"$f":"\"Identification and Name\nLateral Limits\n\n\"&B3","v":"Identification and Name\nLateral Limits\n\n"},null,"Optional 1.\nTextual description to describe join type. Great circle line assumed if blank","Optional 2. Radius of arc","Upper Limit\nLower Limit","Remarks\n(time of activity, type of restriction, nature of hazard, risk of interception)","CAA\nissues to resolve?","Additional CAA Comments"]
[null,null,{"$f":"IF(B8=\"\",\"\",IFERROR(VLOOKUP($B8,'Latitude & Longitude'!$B$5:$L$1001,7,FALSE),\"No Change\"))","v":""},{"$f":"IF(B8=\"\",\"\",IFERROR(VLOOKUP($B8,'Latitude & Longitude'!$B$5:$L$1001,11,FALSE),\"No Change\"))","v":""}]
{"$rows_left_out":26}
{"sheet":"AD 2.17 Temp","index":8,"n_rows":33,"n_cols":14,"rows_kept":33,"cut":false,"hidden":true,"merged":[[7,11,31,11],[6,2,6,3],[7,6,31,6],[7,7,31,7],[7,8,31,8],[7,9,31,9],[7,10,31,10],[1,7,1,13],[2,1,2,2],[2,4,2,5],[2,7,2,13],[4,1,5,1],[4,12,5,12],[4,13,5,13]]}
[]
[null,"1. Name of Airspace:",null,null,{"$f":"\"2a. Partial or complete description of \"&B3&\":\"","v":"2a. Partial or complete description of :"},null,null,{"$f":"IF(E3=\"Partial\",\"2b. Please describe parts of \"&B3&\" not included in this entry, therefore assumed unchanged:\",\"2b. N/A\")","v":"2b. N/A"}]
[]
[]
[null,"\n\n\n\n\n","AD 2.17 AIR TRAFFIC SERVICES AIRSPACE",null,null,null,null,null,null,null,null,null,{"$f":"\"A total of \"&COUNTIF(M8:M32,\"Yes\")","v":"A total of 0"}]
[null,null,"Only one named airspace per worksheet - additional sheets are added via the Content and Approval tab. "]
[null,"Select points below in publication order (Origin North/West & Clockwise)",{"$f":"\"Designation and lateral limits\n\n\n\"&B3","v":"Designation and lateral limits\n\n\n"},null,"Optional 1.\nTextual description to describe join type. Great circle line assumed if blank","Optional 2. Radius of arc","Vertical Limits","Airspace Class","ATS unit callsign/language","Transition\nAltitude","Hours of Applicability","Remarks","CAA\nissues to resolve?","\nAdditional CAA Comments"]
[null,null,{"$f":"IF(B8=\"\",\"\",IFERROR(VLOOKUP($B8,'Latitude & Longitude'!$B$5:$L$1001,7,FALSE),\"No Change\"))","v":""},{"$f":"IF(B8=\"\",\"\",IFERROR(VLOOKUP($B8,'Latitude & Longitude'!$B$5:$L$1001,11,FALSE),\"No Change\"))","v":""}]
{"$rows_left_out":26}
{"sheet":"Other Airspace Temp","index":9,"n_rows":58,"n_cols":12,"rows_kept":58,"cut":false,"hidden":true,"merged":[[4,1,5,1],[4,10,5,10],[4,11,5,11],[6,2,6,3],[7,6,54,6],[7,7,54,7],[7,8,54,8],[7,9,54,9],[1,1,1,3],[1,10,1,12],[2,1,2,3],[2,4,2,5],[2,7,2,9],[2,10,2,11]]}
[]
[null,"1a. AIP section or method of promulgation",null,null,"1b. Name of Airspace or Route:",null,null,{"$f":"\"2a. Partial or complete description of \"&E3&\":\"","v":"2a. Partial or complete description of :"},null,null,{"$f":"IF(H3=\"Partial\",\"2b. Describe parts of \"&E3&\" not included in this entry (therefore assumed unchanged):\",\"2b. N/A\")","v":"2b. N/A"}]
[]
[]
[null,"\n\n\n\n\n",{"$f":"\"Other Airspace - \"&B3","v":"Other Airspace - "},null,null,null,null,null,null,null,{"$f":"\"A total of \"&COUNTIF(K8:K55,\"Yes\")","v":"A total of 0"}]
[null,null,"Only one named airspace per worksheet - additional sheets are added via the Content and Approval tab. "]
[null,"Select points below in publication order (Origin North/West & Clockwise)",{"$f":"\"Designation and lateral limits\n\n\n\"&E3","v":"Designation and lateral limits\n\n\n"},null,"Optional 1.\nTextual description to describe join type. Great circle line assumed if blank","Optional 2. Radius of arc","Column Heading 1\n(Rename)","Column Heading 2\n(Rename)","Column Heading 3\n(Rename)","Column Heading 4\n(Rename)","CAA\nissues to resolve?","Additional CAA Comments"]
[null,null,{"$f":"IF(B8=\"\",\"\",IFERROR(VLOOKUP($B8,'Latitude & Longitude'!$B$5:$L$1001,7,FALSE),\"No Change\"))","v":""},{"$f":"IF(B8=\"\",\"\",IFERROR(VLOOKUP($B8,'Latitude & Longitude'!$B$5:$L$1001,11,FALSE),\"No Change\"))","v":""}]
{"$rows_left_out":51}
{"sheet":"Metadata","index":10,"n_rows":63,"n_cols":15,"rows_kept":63,"cut":false,"hidden":false,"merged":[[62,4,62,7],[12,6,12,7],[11,6,11,7],[34,4,34,7],[7,4,7,7],[19,4,19,7],[14,2,15,2],[20,2,21,2],[48,2,49,2],[29,9,30,9],[44,8,45,8],[14,8,15,8],[44,9,45,9],[38,9,39,9],[44,2,45,2],[8,1,14,1],[20,1,29,1],[35,1,61,1],[23,2,24,2],[8,9,9,9],[14,9,15,9],[11,9,12,9],[53,2,60,2],[41,2,42,2],[26,2,27,2],[29,2,30,2],[35,2,36,2],[38,2,39,2],[11,8,12,8],[8,2,9,2],[11,2,12,2],[8,11,14,11],[20,11,29,11],[35,11,61,11],[26,8,27,8],[23,8,24,8],[20,8,21,8],[20,9,21,9],[23,9,24,9],[26,9,27,9],[35,8,36,8],[35,9,36,9],[29,8,30,8],[8,8,9,8],[41,8,42,8],[41,9,42,9],[38,8,39,8],[1,9,3,9],[1,8,3,8],[1,3,1,7],[2,3,2,7],[3,3,3,7],[6,3,6,7],[0,7,0,8],[5,1,5,3],[5,4,5,7],[4,4,4,7]]}
[]
[null,null,null,null,null,null,null,null,{"$f":"\"A total of \"&COUNTIF(I4:I63,\"Yes\")","v":"A total of 0"},null,null,null,3,"Level 1 ACP","A change to the notified airspace design that has the potential for a high impact on aviation and/or non-aviation stakeholders….. Section 1, 2 & 3 of metadata are required."]
[null,null,null,{"$f":"\"Metadata relating to \"&'Content & Approval'!C9","v":"Metadata relating to My Airspace Project "},null,null,null,null,null,null,null,null,3,"Level 2 ACP","A change to the notified airspace design that has the potential for a medium impact on aviation and/or non-aviation stakeholders….. Section 1, 2 & 3 of metadata are required."]
[null,null,null,"Required for CAP 1616 project data bound for the AIP (See CAP 1054 Annex A). Complete all cells marked with *",null,null,null,null,null,null,null,null,3,"Level 3 ACP (with geodetic calculations)","A change to the notified airspace design that has the potential for a low impact on both aviation and non-aviation stakeholders. New geodetic data is included in the submission….. Section 1, 2 & 3 of metadata are required."]
[null,"Select the ACP Level/Type Below:",null,null,{"$f":"IF(B6=\"\",\"\",\"A generic summary of the ACP Level & ADQ metadata requirements are below:\")","v":""},null,null,null,{"$f":"COUNTIF(I9:I63,\"Yes\")","v":0},null,null,null,2,"Level 3 ACP (no geodetic calculations)","A change to the notified airspace design that has the potential for a low impact on both aviation and non-aviation stakeholders. No new geodetic data is included in the submission….. Section 1 & 2 only of metadata are required."]
[null,null,null,null,{"$f":"IF(B6=N2,O2,IF(B6=N3,O3,IF(B6=N4,O4,IF(B6=N5,O5,IF(B6=N6,O6,\"\")))))","v":""},null,null,null,"CAA issues to resolve?","Additional CAA Comments",null,null,0,"ICARD 5LNC/IFP Waypoints","No metadata required for this provisional approval. Should the 5LNC/s be incorporated within routes published in the AIP at a later stage of this project, metadata will then be required."]
[{"$f":"'Latitude & Longitude'!F1","v":0},{"$f":"'Latitude & Longitude'!F1&Metadata!B6","v":""},null,{"$f":"IF(B7=\"YESOther Change to Airspace (NOT Airspace Design)\",\"ERROR - you have selected NOT Airspace Design but new calculated geodetics are included in the LAT/LONG sheet\",\"\")","v":""}]
[{"$f":"IF(E10=\"\",\"1\",IF(G10=\"\",\"1\",IF(H10=\"\",\"1\",IF(E13=\"\",\"1\",IF(F13=\"\",\"1\",IF(G13=\"\",\"1\",IF(E16=\"\",\"1\",IF(F16=\"\",\"1\",IF(G16=\"\",\"1\",IF(H16=\"\",\"1\",\"0\"))))))))))","v":"1"},null,null,{"$f":"IF(B6=\"\",\"\",IF(B6=N2,\"Please complete this section:\",IF(B6=N3,\"Please complete this section:\",IF(B6=N4,\"Please complete this section:\",IF(B6=N5,\"Please complete this section:\",IF(B6=N6,\"Not Required\"))))))","v":""},{"$f":"IF(D8=\"\",\"\",IF(D8=\"Not Required\",\"\",IF(A8=\"1\",\"Additional input required in Section 1 to meet the requirements of ADQ\",\"Minimum content achieved for Section 1\")))","v":""},null,null,null,{"$f":"IF(D8=\"\",\"\",IF(D8=\"Not Required\",\"\",IF(A8=\"1\",\"r\",\"a\")))","v":""}]
{"$rows_left_out":55}