{"text_format":"1","workbook":"xlsx","n_sheets":11,"sheets":["Version History","Lookup","Content & Approval","ICARD","Latitude & Longitude","ENR 2 Temp","ENR 3 Temp","ENR 5.1 Temp","AD 2.17 Temp","Other Airspace Temp","Metadata"],"not_rendered":{"charts":0,"images":2,"macros":1,"external_links":0,"defined_names":20,"comments":9,"pivot_tables":0},"unopened":[],"bounds":{"document_bytes":16777216,"sheet_cells":100000,"rows_first":2000,"rows_last":500,"rows_between":2000,"halvings":0,"cell_chars":16384,"cell_head_chars":4096},"cells_cut":0,"cells_raw":0,"read":"whole","date_system":"1900"}

{"sheet":"Version History","index":0,"n_rows":37,"n_cols":2,"rows_kept":37,"cut":false,"hidden":true,"merged":[]}
["Date","Issue Updates"]
[null,"UAT"]
["2018-12-20","Textual amendments\nFormatting\n"]
["2019-01-15","Protection of macros/restricting unprotect\nDuplicate sheets not keeping protection\nDuplicate sheets losing functionality\nRoute/Airspace Name Cell has larger text\nRows (not columns) can now be extended downwards in AIP templates\n"]
["2019-02-11","Cells Wrapped to improve legibility\nRows (not columns) can now be extended downwards in Lat/Long Sheet\nFormatting issues on longitude field corrected.\nAdditional column added for Hours of Applicability AD 2.17\nTracks and Distance values now held to 5dp\nAD 2.17/ENR 5.1 – drop-down list extended in Column E\nAD 2.17 minor formatting to columns F-I\nText on metadata sheet\nIssue dates/details added - versioning removed to avoid confusion with submitted version\n"]
["2019-06-20","Additional Rows Added to Track & Distance sheet. Resulting Drop down list re-formatted.\nAll sheets now permit formatting of rows/columns/cells.\nMetadata sheet re-formatted."]
["2019-07-01","Tab Navigation and cross reference added.\nContent page re-formatted.\nENR sheets lookup range extended."]
["2019-07-23","No Design Content' option incorporated in metadata.\nLook up list ranges extended for ENR2.1 and associated templates."]
["2020-05-22","Numerous revisions and improvements after consulting with selected stakeholders:\nGreen cells to be locked (by regulator) after approval\nICARD columns renamed for clarity\nAny 'Yes' entries indicating futher attention needed will appear red\nData assurance levels explained in Lat/Long Sheet\nMethod of inputting Lat/Long descriptions for ENR 2.1/5.1/AD 2.17 and Other Airspace has been improved to leave no ambiguity.\nColumn H in ENR 2.1 - header update\nENR 2.1/5.1/AD 2.17 and Other Airspace have initial entry rows limited to 10, but can be expanded\nNew Summary inputs x3 required at header of each AIP template.\nAdded validation to enforce cruising level entries  Odd/Even.\nMetadata requirement further simplified\nENR 3x Column L Header updated\nChange of default data rentention to indefinite.\n"]
["2021-05-14","Corporate colour scheme introduced and new look to front page"]
["2021-05-14","Improved addition and deletion of AIP templates"]
["2021-05-14","Removal of Seperate Track & Distance Sheet. Add Tracks and Distances directly into ENR 3"]
["2021-05-14","Check box to show reulated version match"]
["2021-05-14","AIP Templates renamed ENR 2 & ENR 3 - with the specific section selected in the header of the individual template"]
["2021-05-14","View all sheets' tab available from all worksheets"]
["2021-05-14","New Airspaces added to 'Primary Airspace Affected' tab"]
["2021-05-14","Ability to plot kml from Latitude & Longitude Sheet and all AIP templates"]
["2021-05-14","Drop down lists now start at the top of all lists"]
["2021-05-14","Ability to rename Aip templates via the Header line"]
["2021-05-14","A header line at the top of each AIP template which requires Type of Airspace, Name, and complete/partial details"]
["2021-05-14","Addition of (then) follow line of latitude to describe rhumbline entries for all AIP templates that describe areas"]
["2021-05-14","Additional instruction on AIP templates to select points in correct order (north/west and clockwise)"]
["2021-05-14","AIP templates - Selection of point names forced in column B - no manual typing. "]
["2021-05-14","No Change' may be selected for Tracks and Distances"]
["2021-05-14","ENR 3 - Upper/Lower limit and Cruising level drop down list functionality improved"]
["2021-05-14","Ability to perform basic manipulation of sheet - such as dragging longer rows and formatting text"]
["2021-05-14","version history included on hidden sheet - with lookup tables."]
["2021-05-14","Metadata sheet re-formatted. New selection choices to indicate type of data submitted. Colour scheme. Numerous default inpuits added to section 3. Number/letters applied to sections for easy reference."]
["2021-05-14","metadata requirement removed for ICARD only"]
["2021-05-14","Cells to expand where overflowing where applicable - other cells should be expanded manually."]
["2021-05-14","Increased use of notes on cells by way of instruction"]
["2021-05-14","Instruction of CAA web page offering advice on how to store the file in sharepoint and open only via the app. "]
["2021-11-26","ENR 3 sections for input/amendment will be restricted to ENR 3.2 Area Navigation Routes & ENR 3.3 Other Routes"]
["2021-11-26","Minor amends to the heading of ENR 3"]
["2021-11-26","Removal of VRP track & Distance option on Lat/Long sheet"]
["2021-11-26","Minor update to metadata page data standards. ETRF89 updated to ETRF2014, 'As per QMS' replaces 'test'.  Rentention period set to indefinite"]
["2024-01-16","Minor update to reflect new ACP levels"]

{"sheet":"Lookup","index":1,"n_rows":36,"n_cols":8,"rows_kept":36,"cut":false,"hidden":true,"merged":[]}
[null,"Feature","DAL","UK Accuracy Required"]
[null,"5LNC Significant Point",2,"30m",1,1.1000000000000001,"Calculated","thence clockwise by arc of a circle #NM/M radius centred on:"]
[null,"AIAA",2,"30m",2,2.1,"Visual","thence anti-clockwise by arc of a circle #NM/M radius centred on:"]
[null,"ATS Airspace Fillet",2,"30m",3,3.1,"Published AIP","Circle #NM/M radius:"]
[null,"ATS or Upper ATS Route",2,"30m",4,4.0999999999999996,"Surveyed","Along coastline to:"]
[null,"ATS RNAV Route",2,"30m",5,5.0999999999999996,"Declared"]
[null,"ATZ",2,"30m",6,6.1]
[null,"CTA",2,"30m",7,7.1]
[null,"CTR",2,"30m",8,8.1]
[null,"Danger Area",2,"30m",9,9.1]
[null,"Delegated Airspace",2,"30m",10,10.1]
[null,"ENR Hold/Fix/WPT",2,"30m",11,11.1]
[null,"FIR/UIR",3,"2km",12,12.1]
[null,"Free Route Airspace",2,"30m",13,13.1]
[null,"Frequency Monitoring Code",2,"30m",14,14.1]
[null,"Heli Route",2,"30m",15,15.1]
[null,"LARS",2,"30m",16,16.100000000000001]
[null,"MATZ",2,"30m",17,17.100000000000001]
[null,"Military Training Area",2,"30m",18,18.100000000000001]
[null,"NAV AID",1,"3m",19,19.100000000000001]
[null,"OCA",2,"30m",20,20.100000000000001]
[null,"Other Airspace",2,"30m"]
[null,"Other Hazardous Airspace",2,"30m"]
[null,"Other Route",2,"30m"]
[null,"Prohibited Area ",2,"30m"]
[null,"Radar Advisory Area",2,"30m"]
[null,"Restricted Airspace (RAS)",2,"30m"]
[null,"Restricted Area",2,"30m"]
[null,"Restricted Area (Unmanned)",2,"30m"]
[null,"RMZ",2,"30m"]
[null,"TDA",2,"30m"]
[null,"TMA",2,"30m"]
[null,"TMZ",2,"30m"]
[null,"TRA",2,"30m"]
[null,"TRA(G)",2,"30m"]
[null,"Visual Reference Point (VRP)*",2,"30m"]

{"sheet":"Content & Approval","index":2,"n_rows":51,"n_cols":18,"rows_kept":51,"cut":false,"hidden":false,"merged":[[11,0,12,0],[13,0,17,0],[21,1,21,11],[7,2,7,3],[11,17,16,19],[1,15,17,15],[22,1,48,11],[8,2,8,3],[1,2,5,6]]}
[]
[null,null,null,null,null,null,null,null,null,null,null,null,null,null,null,"Click + to show/hide guidance notes >"]
[]
[]
[]
[]
[]
[null,"Enter ACP Ref:","Enter Name of Airspace Change Project:",null,"Submitted Vers.","Regulated Vers.","Overall Approval",null,null,null,null,null,null,"Cell input Guidance:"]
[null,"YYYY-###","My Airspace Project ",null,1,null,{"$f":"IF(AND(COUNTIF(K12:K19,TRUE) = COUNTIF(L12:L19,TRUE),E10=100.1),\"Approved\",\"Not Approved\")","v":"Not Approved"},null,null,null,null,null,null,"Data Originator"]
[null,null,null,{"$f":"(F9-E9)","v":-1},{"$f":"F9-E9+100","v":99},{"$f":"IF(E9=\"\",\"\",IF(E10=100.1,\"a\",\"r\"))","v":"r"},null,null,null,null,null,null,null,"Regulator Only"]
[null,"WorkSheet Name","WorkSheet Content","Included?","Date Approved","CAA Regulator","Sheet Approval","Included","Date Added ","Sig","AND","OR",null,"Formula/No entry"]
[null,"ICARD","5LNC requested and reserved via the ICAO portal","No",null,null,{"$f":"IF(K12,\"a\",IF(K12<>L12,\"r\",\"\"))","v":""},{"$f":"D12=\"Yes\"","v":false},{"$f":"E12<>\"\"","v":false},{"$f":"F12<>\"\"","v":false},{"$f":"AND(H12:J12)","v":false},{"$f":"OR(H12:J12)","v":false},null,"Default Entry",null,null,null,"If you wish to delete any AIP Template, first select from the list below, then hit the Delete Sheet button."]
[null,"Latitude & Longitude","Geodetic points (independent and/or part of an area or route)","Yes",null,null,{"$f":"IF(K13,\"a\",IF(K13<>L13,\"r\",\"\"))","v":"r"},{"$f":"D13=\"Yes\"","v":true},{"$f":"E13<>\"\"","v":false},{"$f":"F13<>\"\"","v":false},{"$f":"AND(H13:J13)","v":false},{"$f":"OR(H13:J13)","v":true}]
["AIP Templates","ENR 2","All Lats/Longs and other details to form draft UK AIP entry ","No",null,null,"",false,false,false,false,false]
[null,"ENR 3","All Lats/Longs, tracks, dist. and other details to form draft UK AIP entry ","No",null,null,"",false,false,false,false,false,null,"Further Reference:"]
[null,"ENR 5.1","All Lats/Longs and other details to form draft UK AIP entry ","No",null,null,"",false,false,false,false,false,null,"Aeronautical Data Policy"]
[null,"AD 2.17","All Lats/Longs and other details to form draft UK AIP entry ","No",null,null,"",false,false,false,false,false,null,"5LNC Policy (ICARD)"]
[null,"Other Airspace","All Lats/Longs and other details to form draft UK AIP entry ","No",null,null,"",false,false,false,false,false,null,"CAP 1054 (ADQ)"]
[null,"Metadata","Generic ADQ Metadata as described in CAP 1054.","Yes",null,null,"r",true,false,false,false,true,null,"CAP 1616 (ACP)"]
[]
[]
[null,"Ongoing comments regarding the content/amendment of this spreadsheet. Please add name and date to each comment:"]
[]
[]
[]
[]
[]
[]
[]
[]
[]
[]
[]
[]
[]
[]
[]
[]
[]
[]
[]
[]
[]
[]
[]
[]
[]
[]
[]
[]
[null,"Check here to ensure you are using the correct version of the Aero Data Sheet - this is release 5.2 dated Jan 2024"]

{"sheet":"ICARD","index":3,"n_rows":205,"n_cols":11,"rows_kept":205,"cut":false,"hidden":true,"merged":[]}
[]
[null,null,null,"ICARD Reservation Requests",null,null,null,null,null,{"$f":"\"A total of \"&COUNTIF(J5:J204,\"YES\")","v":"A total of 0"}]
[null,null,null,null,null,null,null,null,null,{"$f":"COUNTIF(J5:J204,\"YES\")","v":0}]
[null,"Working Name of 5LNC","ICARD Requested 5LNC","ICARD Description","ICARD Proximity Latitude used","ICARD Proximity Longitude used","Reserved ICARD 5LNC","ICARD Submission Date","ICARD Approval Date","CAA issues to resolve?","Additional CAA Comments"]
[]
[]
[]
[]
[]
[]
[]
[]
[]
[]
[]
[]
[]
[]
[]
[]
[]
[]
[]
[]
[]
[]
[]
[]
[]
[]
[]
[]
[]
[]
[]
[]
[]
[]
[]
[]
[]
[]
[]
[]
[]
[]
[]
[]
[]
[]
[]
[]
[]
[]
[]
[]
[]
[]
[]
[]
[]
[]
[]
[]
[]
[]
[]
[]
[]
[]
[]
[]
[]
[]
[]
[]
[]
[]
[]
[]
[]
[]
[]
[]
[]
[]
[]
[]
[]
[]
[]
[]
[]
[]
[]
[]
[]
[]
[]
[]
[]
[]
[]
[]
[]
[]
[]
[]
[]
[]
[]
[]
[]
[]
[]
[]
[]
[]
[]
[]
[]
[]
[]
[]
[]
[]
[]
[]
[]
[]
[]
[]
[]
[]
[]
[]
[]
[]
[]
[]
[]
[]
[]
[]
[]
[]
[]
[]
[]
[]
[]
[]
[]
[]
[]
[]
[]
[]
[]
[]
[]
[]
[]
[]
[]
[]
[]
[]
[]
[]
[]
[]
[]
[]
[]
[]
[]
[]
[]
[]
[]
[]
[]
[]
[]
[]
[]
[]
[]
[]
[]
[]
[]
[]
[]
[]
[]
[]
[]
[]
[]
[]
[]
[]
[null,null,null,null,null,null,null,null,null,{"$f":"COUNTIF(J5:J204,\"YES\")","v":0}]

{"sheet":"Latitude & Longitude","index":4,"n_rows":205,"n_cols":43,"rows_kept":205,"cut":false,"hidden":false,"merged":[]}
[]
[null,null,"  ","Latitude & Longitude",null,null,null,"a Paste a",null,"x Paste x",null,"a Paste a",null,"x Paste x",null,{"$f":"\"A total of \"&COUNTIF(P5:P204,\"Yes\")","v":"A total of 0"},null,null,null,null,null,null,null,null,null,null,null,null,null,null,null,null,null,null,null,null,null,null,null,null,null,"from h5","from L5"]
[null,null,null,null,null,null,null,null,null,null,null,null,null,null,null,{"$f":"COUNTIF(P5:P204,\"Yes\")","v":0}]
[null,"Name of Point","Primary Airspace Usage","DAL ","UK Accuracy ","Origination Type","Point Origination Description","Latitude","format","Latitude\nDouble Check","match","Longitude","format","Longitude\nDouble Check","match","CAA issues to resolve?","Additional CAA Comments","Breakdown of DEG","Error DEG","Breakdown of MIN","Error MIN","Breakdown of SEC (1)","Error SEC 1","LENTH of LAT","LENGTH OF LAT ERROR","Breakdown of Hemisphere","Error Hemisphere","Total Lat Error",null,"Breakdown of DEG","Error Deg","Breakdown of MIN","Error Min","Breakdown of SEC","Error SEC","Breakdown of meridian","Error meridian","LENGTH of LONG","LENGTH of LONG ERROR","Total Long Error",null,"Google Earth Lat","Google Earth Long"]
[null,null,null,{"$f":"IF(C5=\"\",\"\",VLOOKUP($C5,Lookup!$B$2:$E$49,2,FALSE))","v":""},{"$f":"IF(C5=\"\",\"\",VLOOKUP($C5,Lookup!$B$2:$E$49,3,FALSE))","v":""},null,null,null,{"$f":"IF(H5=\"\",\"\",IF(AB5+0>0,\"r\",IF(AB5+0=0,\"a\",\"\")))","v":""},null,{"$f":"IF(H5=\"\",\"\",IF(H5=J5,\"a\",\"r\"))","v":""},null,{"$f":"IF(L5=\"\",\"\",IF(AN5+0>0,\"r\",IF(AN5+0=0,\"a\",\"\")))","v":""},null,{"$f":"IF(L5=\"\",\"\",IF(L5=N5,\"a\",\"r\"))","v":""},null,null,{"$f":"IF(H5=\"\",\"\",LEFT(H5,2)+0)","v":""},{"$f":"IF(H5=\"\",\"0\",IF(AND(R5>=40,R5<=70),\"0\",\"1\"))","v":"0"},{"$f":"IF(H5=\"\",\"\",MID(H5,3,2)+0)","v":""},{"$f":"IF(H5=\"\",\"0\",IF(T5>59,\"1\",\"0\"))","v":"0"},{"$f":"IF(H5=\"\",\"\",MID(H5,5,5)+0)","v":""},{"$f":"IFERROR(V5>60,\"1\")","v":true},{"$f":"LEN(H5)","v":0},{"$f":"IF(X5<10,\"1\",\"0\")","v":"1"},{"$f":"RIGHT(H5,1)","v":""},{"$f":"IF(Z5=\"\",\"0\",IF(Z5=\"N\",\"0\",\"1\"))","v":"0"},{"$f":"S5+U5++Y5+W5+AA5","v":2},null,{"$f":"IF(L5=\"\",\"\",LEFT(L5,3)+0)","v":""},{"$f":"IF(L5=\"\",\"0\",IF(AD5>20,\"1\",\"0\"))","v":"0"},{"$f":"IF(L5=\"\",\"\",MID(L5,4,2)+0)","v":""},{"$f":"IF(L5=\"\",\"0\",IF(AF5>59,\"1\",\"0\"))","v":"0"},{"$f":"IF(L5=\"\",\"\",MID(L5,6,5)+0)","v":""},{"$f":"IFERROR(AH5>60,\"1\")","v":true},{"$f":"RIGHT(L5,1)","v":""},{"$f":"IF(L5=\"\",\"0\",IF(AJ5=\"W\",\"0\",IF(AJ5=\"E\",\"0\",\"1\")))","v":"0"},{"$f":"LEN(L5)","v":0},{"$f":"IF(AL5<11,\"1\",\"0\")","v":"1"},{"$f":"AE5+AG5+AI5+AK5+AM5","v":2},null,{"$f":"LEFT(H5,2)&\" \"& MID(H5,3,2)&\" \"&MID(H5,5,10)","v":"  "},{"$f":"LEFT(L5,3)&\" \"& MID(L5,4,2)&\" \"&MID(L5,6,10)","v":"  "}]
[null,null,null,{"$f":"IF(C6=\"\",\"\",VLOOKUP($C6,Lookup!$B$2:$E$49,2,FALSE))","v":""},{"$f":"IF(C6=\"\",\"\",VLOOKUP($C6,Lookup!$B$2:$E$49,3,FALSE))","v":""},null,null,null,{"$f":"IF(H6=\"\",\"\",IF(AB6+0>0,\"r\",IF(AB6+0=0,\"a\",\"\")))","v":""},null,{"$f":"IF(H6=\"\",\"\",IF(H6=J6,\"a\",\"r\"))","v":""},null,{"$f":"IF(L6=\"\",\"\",IF(AN6+0>0,\"r\",IF(AN6+0=0,\"a\",\"\")))","v":""},null,{"$f":"IF(L6=\"\",\"\",IF(L6=N6,\"a\",\"r\"))","v":""},null,null,{"$f":"IF(H6=\"\",\"\",LEFT(H6,2)+0)","v":""},{"$f":"IF(H6=\"\",\"0\",IF(AND(R6>=40,R6<=70),\"0\",\"1\"))","v":"0"},{"$f":"IF(H6=\"\",\"\",MID(H6,3,2)+0)","v":""},{"$f":"IF(H6=\"\",\"0\",IF(T6>59,\"1\",\"0\"))","v":"0"},{"$f":"IF(H6=\"\",\"\",MID(H6,5,5)+0)","v":""},{"$f":"IFERROR(V6>60,\"1\")","v":true},{"$f":"LEN(H6)","v":0},{"$f":"IF(X6<10,\"1\",\"0\")","v":"1"},{"$f":"RIGHT(H6,1)","v":""},{"$f":"IF(Z6=\"\",\"0\",IF(Z6=\"N\",\"0\",\"1\"))","v":"0"},{"$f":"S6+U6++Y6+W6+AA6","v":2},null,{"$f":"IF(L6=\"\",\"\",LEFT(L6,3)+0)","v":""},{"$f":"IF(L6=\"\",\"0\",IF(AD6>20,\"1\",\"0\"))","v":"0"},{"$f":"IF(L6=\"\",\"\",MID(L6,4,2)+0)","v":""},{"$f":"IF(L6=\"\",\"0\",IF(AF6>59,\"1\",\"0\"))","v":"0"},{"$f":"IF(L6=\"\",\"\",MID(L6,6,5)+0)","v":""},{"$f":"IFERROR(AH6>60,\"1\")","v":true},{"$f":"RIGHT(L6,1)","v":""},{"$f":"IF(L6=\"\",\"0\",IF(AJ6=\"W\",\"0\",IF(AJ6=\"E\",\"0\",\"1\")))","v":"0"},{"$f":"LEN(L6)","v":0},{"$f":"IF(AL6<11,\"1\",\"0\")","v":"1"},{"$f":"AE6+AG6+AI6+AK6+AM6","v":2},null,{"$f":"LEFT(H6,2)&\" \"& MID(H6,3,2)&\" \"&MID(H6,5,10)","v":"  "},{"$f":"LEFT(L6,3)&\" \"& MID(L6,4,2)&\" \"&MID(L6,6,10)","v":"  "}]
[null,null,null,{"$f":"IF(C7=\"\",\"\",VLOOKUP($C7,Lookup!$B$2:$E$49,2,FALSE))","v":""},{"$f":"IF(C7=\"\",\"\",VLOOKUP($C7,Lookup!$B$2:$E$49,3,FALSE))","v":""},null,null,null,"",null,"",null,"",null,"",null,null,"","0","","0","",true,0,"1","","0",2,null,"","0","","0","",true,"","0",0,"1",2,null,"  ","  "]
[null,null,null,{"$f":"IF(C8=\"\",\"\",VLOOKUP($C8,Lookup!$B$2:$E$49,2,FALSE))","v":""},{"$f":"IF(C8=\"\",\"\",VLOOKUP($C8,Lookup!$B$2:$E$49,3,FALSE))","v":""},null,null,null,"",null,"",null,"",null,"",null,null,"","0","","0","",true,0,"1","","0",2,null,"","0","","0","",true,"","0",0,"1",2,null,"  ","  "]
[null,null,null,{"$f":"IF(C9=\"\",\"\",VLOOKUP($C9,Lookup!$B$2:$E$49,2,FALSE))","v":""},{"$f":"IF(C9=\"\",\"\",VLOOKUP($C9,Lookup!$B$2:$E$49,3,FALSE))","v":""},null,null,null,"",null,"",null,"",null,"",null,null,"","0","","0","",true,0,"1","","0",2,null,"","0","","0","",true,"","0",0,"1",2,null,"  ","  "]
[null,null,null,{"$f":"IF(C10=\"\",\"\",VLOOKUP($C10,Lookup!$B$2:$E$49,2,FALSE))","v":""},{"$f":"IF(C10=\"\",\"\",VLOOKUP($C10,Lookup!$B$2:$E$49,3,FALSE))","v":""},null,null,null,"",null,"",null,"",null,"",null,null,"","0","","0","",true,0,"1","","0",2,null,"","0","","0","",true,"","0",0,"1",2,null,"  ","  "]
[null,null,null,{"$f":"IF(C11=\"\",\"\",VLOOKUP($C11,Lookup!$B$2:$E$49,2,FALSE))","v":""},{"$f":"IF(C11=\"\",\"\",VLOOKUP($C11,Lookup!$B$2:$E$49,3,FALSE))","v":""},null,null,null,{"$f":"IF(H11=\"\",\"\",IF(AB11+0>0,\"r\",IF(AB11+0=0,\"a\",\"\")))","v":""},null,"",null,"",null,"",null,null,"","0","","0","",true,0,"1","","0",2,null,"","0","","0","",true,"","0",0,"1",2,null,"  ","  "]
[null,null,null,{"$f":"IF(C12=\"\",\"\",VLOOKUP($C12,Lookup!$B$2:$E$49,2,FALSE))","v":""},{"$f":"IF(C12=\"\",\"\",VLOOKUP($C12,Lookup!$B$2:$E$49,3,FALSE))","v":""},null,null,null,"",null,"",null,"",null,"",null,null,"","0","","0","",true,0,"1","","0",2,null,"","0","","0","",true,"","0",0,"1",2,null,"  ","  "]
[null,null,null,{"$f":"IF(C13=\"\",\"\",VLOOKUP($C13,Lookup!$B$2:$E$49,2,FALSE))","v":""},{"$f":"IF(C13=\"\",\"\",VLOOKUP($C13,Lookup!$B$2:$E$49,3,FALSE))","v":""},null,null,null,"",null,"",null,"",null,"",null,null,"","0","","0","",true,0,"1","","0",2,null,"","0","","0","",true,"","0",0,"1",2,null,"  ","  "]
[null,null,null,{"$f":"IF(C14=\"\",\"\",VLOOKUP($C14,Lookup!$B$2:$E$49,2,FALSE))","v":""},{"$f":"IF(C14=\"\",\"\",VLOOKUP($C14,Lookup!$B$2:$E$49,3,FALSE))","v":""},null,null,null,"",null,"",null,"",null,"",null,null,"","0","","0","",true,0,"1","","0",2,null,"","0","","0","",true,"","0",0,"1",2,null,"  ","  "]
[null,null,null,{"$f":"IF(C15=\"\",\"\",VLOOKUP($C15,Lookup!$B$2:$E$49,2,FALSE))","v":""},{"$f":"IF(C15=\"\",\"\",VLOOKUP($C15,Lookup!$B$2:$E$49,3,FALSE))","v":""},null,null,null,"",null,"",null,"",null,"",null,null,"","0","","0","",true,0,"1","","0",2,null,"","0","","0","",true,"","0",0,"1",2,null,"  ","  "]
[null,null,null,{"$f":"IF(C16=\"\",\"\",VLOOKUP($C16,Lookup!$B$2:$E$49,2,FALSE))","v":""},{"$f":"IF(C16=\"\",\"\",VLOOKUP($C16,Lookup!$B$2:$E$49,3,FALSE))","v":""},null,null,null,"",null,"",null,"",null,"",null,null,"","0","","0","",true,0,"1","","0",2,null,"","0","","0","",true,"","0",0,"1",2,null,"  ","  "]
[null,null,null,{"$f":"IF(C17=\"\",\"\",VLOOKUP($C17,Lookup!$B$2:$E$49,2,FALSE))","v":""},{"$f":"IF(C17=\"\",\"\",VLOOKUP($C17,Lookup!$B$2:$E$49,3,FALSE))","v":""},null,null,null,"",null,"",null,"",null,"",null,null,"","0","","0","",true,0,"1","","0",2,null,"","0","","0","",true,"","0",0,"1",2,null,"  ","  "]
[null,null,null,{"$f":"IF(C18=\"\",\"\",VLOOKUP($C18,Lookup!$B$2:$E$49,2,FALSE))","v":""},{"$f":"IF(C18=\"\",\"\",VLOOKUP($C18,Lookup!$B$2:$E$49,3,FALSE))","v":""},null,null,null,"",null,"",null,"",null,"",null,null,"","0","","0","",true,0,"1","","0",2,null,"","0","","0","",true,"","0",0,"1",2,null,"  ","  "]
[null,null,null,{"$f":"IF(C19=\"\",\"\",VLOOKUP($C19,Lookup!$B$2:$E$49,2,FALSE))","v":""},{"$f":"IF(C19=\"\",\"\",VLOOKUP($C19,Lookup!$B$2:$E$49,3,FALSE))","v":""},null,null,null,"",null,"",null,"",null,"",null,null,"","0","","0","",true,0,"1","","0",2,null,"","0","","0","",true,"","0",0,"1",2,null,"  ","  "]
[null,null,null,{"$f":"IF(C20=\"\",\"\",VLOOKUP($C20,Lookup!$B$2:$E$49,2,FALSE))","v":""},{"$f":"IF(C20=\"\",\"\",VLOOKUP($C20,Lookup!$B$2:$E$49,3,FALSE))","v":""},null,null,null,"",null,"",null,"",null,"",null,null,"","0","","0","",true,0,"1","","0",2,null,"","0","","0","",true,"","0",0,"1",2,null,"  ","  "]
[null,null,null,{"$f":"IF(C21=\"\",\"\",VLOOKUP($C21,Lookup!$B$2:$E$49,2,FALSE))","v":""},{"$f":"IF(C21=\"\",\"\",VLOOKUP($C21,Lookup!$B$2:$E$49,3,FALSE))","v":""},null,null,null,"",null,"",null,"",null,"",null,null,"","0","","0","",true,0,"1","","0",2,null,"","0","","0","",true,"","0",0,"1",2,null,"  ","  "]
[null,null,null,{"$f":"IF(C22=\"\",\"\",VLOOKUP($C22,Lookup!$B$2:$E$49,2,FALSE))","v":""},{"$f":"IF(C22=\"\",\"\",VLOOKUP($C22,Lookup!$B$2:$E$49,3,FALSE))","v":""},null,null,null,"",null,"",null,"",null,"",null,null,"","0","","0","",true,0,"1","","0",2,null,"","0","","0","",true,"","0",0,"1",2,null,"  ","  "]
[null,null,null,{"$f":"IF(C23=\"\",\"\",VLOOKUP($C23,Lookup!$B$2:$E$49,2,FALSE))","v":""},{"$f":"IF(C23=\"\",\"\",VLOOKUP($C23,Lookup!$B$2:$E$49,3,FALSE))","v":""},null,null,null,"",null,"",null,"",null,"",null,null,"","0","","0","",true,0,"1","","0",2,null,"","0","","0","",true,"","0",0,"1",2,null,"  ","  "]
[null,null,null,{"$f":"IF(C24=\"\",\"\",VLOOKUP($C24,Lookup!$B$2:$E$49,2,FALSE))","v":""},{"$f":"IF(C24=\"\",\"\",VLOOKUP($C24,Lookup!$B$2:$E$49,3,FALSE))","v":""},null,null,null,"",null,"",null,"",null,"",null,null,"","0","","0","",true,0,"1","","0",2,null,"","0","","0","",true,"","0",0,"1",2,null,"  ","  "]
[null,null,null,{"$f":"IF(C25=\"\",\"\",VLOOKUP($C25,Lookup!$B$2:$E$49,2,FALSE))","v":""},{"$f":"IF(C25=\"\",\"\",VLOOKUP($C25,Lookup!$B$2:$E$49,3,FALSE))","v":""},null,null,null,"",null,"",null,"",null,"",null,null,"","0","","0","",true,0,"1","","0",2,null,"","0","","0","",true,"","0",0,"1",2,null,"  ","  "]
[null,null,null,{"$f":"IF(C26=\"\",\"\",VLOOKUP($C26,Lookup!$B$2:$E$49,2,FALSE))","v":""},{"$f":"IF(C26=\"\",\"\",VLOOKUP($C26,Lookup!$B$2:$E$49,3,FALSE))","v":""},null,null,null,"",null,"",null,"",null,"",null,null,"","0","","0","",true,0,"1","","0",2,null,"","0","","0","",true,"","0",0,"1",2,null,"  ","  "]
[null,null,null,{"$f":"IF(C27=\"\",\"\",VLOOKUP($C27,Lookup!$B$2:$E$49,2,FALSE))","v":""},{"$f":"IF(C27=\"\",\"\",VLOOKUP($C27,Lookup!$B$2:$E$49,3,FALSE))","v":""},null,null,null,"",null,"",null,"",null,"",null,null,"","0","","0","",true,0,"1","","0",2,null,"","0","","0","",true,"","0",0,"1",2,null,"  ","  "]
[null,null,null,{"$f":"IF(C28=\"\",\"\",VLOOKUP($C28,Lookup!$B$2:$E$49,2,FALSE))","v":""},{"$f":"IF(C28=\"\",\"\",VLOOKUP($C28,Lookup!$B$2:$E$49,3,FALSE))","v":""},null,null,null,"",null,"",null,"",null,"",null,null,"","0","","0","",true,0,"1","","0",2,null,"","0","","0","",true,"","0",0,"1",2,null,"  ","  "]
[null,null,null,{"$f":"IF(C29=\"\",\"\",VLOOKUP($C29,Lookup!$B$2:$E$49,2,FALSE))","v":""},{"$f":"IF(C29=\"\",\"\",VLOOKUP($C29,Lookup!$B$2:$E$49,3,FALSE))","v":""},null,null,null,"",null,"",null,"",null,"",null,null,"","0","","0","",true,0,"1","","0",2,null,"","0","","0","",true,"","0",0,"1",2,null,"  ","  "]
[null,null,null,{"$f":"IF(C30=\"\",\"\",VLOOKUP($C30,Lookup!$B$2:$E$49,2,FALSE))","v":""},{"$f":"IF(C30=\"\",\"\",VLOOKUP($C30,Lookup!$B$2:$E$49,3,FALSE))","v":""},null,null,null,"",null,"",null,"",null,"",null,null,"","0","","0","",true,0,"1","","0",2,null,"","0","","0","",true,"","0",0,"1",2,null,"  ","  "]
[null,null,null,{"$f":"IF(C31=\"\",\"\",VLOOKUP($C31,Lookup!$B$2:$E$49,2,FALSE))","v":""},{"$f":"IF(C31=\"\",\"\",VLOOKUP($C31,Lookup!$B$2:$E$49,3,FALSE))","v":""},null,null,null,"",null,"",null,"",null,"",null,null,"","0","","0","",true,0,"1","","0",2,null,"","0","","0","",true,"","0",0,"1",2,null,"  ","  "]
[null,null,null,{"$f":"IF(C32=\"\",\"\",VLOOKUP($C32,Lookup!$B$2:$E$49,2,FALSE))","v":""},{"$f":"IF(C32=\"\",\"\",VLOOKUP($C32,Lookup!$B$2:$E$49,3,FALSE))","v":""},null,null,null,"",null,"",null,"",null,"",null,null,"","0","","0","",true,0,"1","","0",2,null,"","0","","0","",true,"","0",0,"1",2,null,"  ","  "]
[null,null,null,{"$f":"IF(C33=\"\",\"\",VLOOKUP($C33,Lookup!$B$2:$E$49,2,FALSE))","v":""},{"$f":"IF(C33=\"\",\"\",VLOOKUP($C33,Lookup!$B$2:$E$49,3,FALSE))","v":""},null,null,null,"",null,"",null,"",null,"",null,null,"","0","","0","",true,0,"1","","0",2,null,"","0","","0","",true,"","0",0,"1",2,null,"  ","  "]
[null,null,null,{"$f":"IF(C34=\"\",\"\",VLOOKUP($C34,Lookup!$B$2:$E$49,2,FALSE))","v":""},{"$f":"IF(C34=\"\",\"\",VLOOKUP($C34,Lookup!$B$2:$E$49,3,FALSE))","v":""},null,null,null,"",null,"",null,"",null,"",null,null,"","0","","0","",true,0,"1","","0",2,null,"","0","","0","",true,"","0",0,"1",2,null,"  ","  "]
[null,null,null,{"$f":"IF(C35=\"\",\"\",VLOOKUP($C35,Lookup!$B$2:$E$49,2,FALSE))","v":""},{"$f":"IF(C35=\"\",\"\",VLOOKUP($C35,Lookup!$B$2:$E$49,3,FALSE))","v":""},null,null,null,"",null,"",null,"",null,"",null,null,"","0","","0","",true,0,"1","","0",2,null,"","0","","0","",true,"","0",0,"1",2,null,"  ","  "]
[null,null,null,{"$f":"IF(C36=\"\",\"\",VLOOKUP($C36,Lookup!$B$2:$E$49,2,FALSE))","v":""},{"$f":"IF(C36=\"\",\"\",VLOOKUP($C36,Lookup!$B$2:$E$49,3,FALSE))","v":""},null,null,null,"",null,"",null,"",null,"",null,null,"","0","","0","",true,0,"1","","0",2,null,"","0","","0","",true,"","0",0,"1",2,null,"  ","  "]
[null,null,null,{"$f":"IF(C37=\"\",\"\",VLOOKUP($C37,Lookup!$B$2:$E$49,2,FALSE))","v":""},{"$f":"IF(C37=\"\",\"\",VLOOKUP($C37,Lookup!$B$2:$E$49,3,FALSE))","v":""},null,null,null,"",null,"",null,"",null,"",null,null,"","0","","0","",true,0,"1","","0",2,null,"","0","","0","",true,"","0",0,"1",2,null,"  ","  "]
[null,null,null,{"$f":"IF(C38=\"\",\"\",VLOOKUP($C38,Lookup!$B$2:$E$49,2,FALSE))","v":""},{"$f":"IF(C38=\"\",\"\",VLOOKUP($C38,Lookup!$B$2:$E$49,3,FALSE))","v":""},null,null,null,"",null,"",null,"",null,"",null,null,"","0","","0","",true,0,"1","","0",2,null,"","0","","0","",true,"","0",0,"1",2,null,"  ","  "]
[null,null,null,{"$f":"IF(C39=\"\",\"\",VLOOKUP($C39,Lookup!$B$2:$E$49,2,FALSE))","v":""},{"$f":"IF(C39=\"\",\"\",VLOOKUP($C39,Lookup!$B$2:$E$49,3,FALSE))","v":""},null,null,null,"",null,"",null,"",null,"",null,null,"","0","","0","",true,0,"1","","0",2,null,"","0","","0","",true,"","0",0,"1",2,null,"  ","  "]
[null,null,null,{"$f":"IF(C40=\"\",\"\",VLOOKUP($C40,Lookup!$B$2:$E$49,2,FALSE))","v":""},{"$f":"IF(C40=\"\",\"\",VLOOKUP($C40,Lookup!$B$2:$E$49,3,FALSE))","v":""},null,null,null,"",null,"",null,"",null,"",null,null,"","0","","0","",true,0,"1","","0",2,null,"","0","","0","",true,"","0",0,"1",2,null,"  ","  "]
[null,null,null,{"$f":"IF(C41=\"\",\"\",VLOOKUP($C41,Lookup!$B$2:$E$49,2,FALSE))","v":""},{"$f":"IF(C41=\"\",\"\",VLOOKUP($C41,Lookup!$B$2:$E$49,3,FALSE))","v":""},null,null,null,"",null,"",null,"",null,"",null,null,"","0","","0","",true,0,"1","","0",2,null,"","0","","0","",true,"","0",0,"1",2,null,"  ","  "]
[null,null,null,{"$f":"IF(C42=\"\",\"\",VLOOKUP($C42,Lookup!$B$2:$E$49,2,FALSE))","v":""},{"$f":"IF(C42=\"\",\"\",VLOOKUP($C42,Lookup!$B$2:$E$49,3,FALSE))","v":""},null,null,null,"",null,"",null,"",null,"",null,null,"","0","","0","",true,0,"1","","0",2,null,"","0","","0","",true,"","0",0,"1",2,null,"  ","  "]
[null,null,null,{"$f":"IF(C43=\"\",\"\",VLOOKUP($C43,Lookup!$B$2:$E$49,2,FALSE))","v":""},{"$f":"IF(C43=\"\",\"\",VLOOKUP($C43,Lookup!$B$2:$E$49,3,FALSE))","v":""},null,null,null,"",null,"",null,"",null,"",null,null,"","0","","0","",true,0,"1","","0",2,null,"","0","","0","",true,"","0",0,"1",2,null,"  ","  "]
[null,null,null,{"$f":"IF(C44=\"\",\"\",VLOOKUP($C44,Lookup!$B$2:$E$49,2,FALSE))","v":""},{"$f":"IF(C44=\"\",\"\",VLOOKUP($C44,Lookup!$B$2:$E$49,3,FALSE))","v":""},null,null,null,"",null,"",null,"",null,"",null,null,"","0","","0","",true,0,"1","","0",2,null,"","0","","0","",true,"","0",0,"1",2,null,"  ","  "]
[null,null,null,{"$f":"IF(C45=\"\",\"\",VLOOKUP($C45,Lookup!$B$2:$E$49,2,FALSE))","v":""},{"$f":"IF(C45=\"\",\"\",VLOOKUP($C45,Lookup!$B$2:$E$49,3,FALSE))","v":""},null,null,null,"",null,"",null,"",null,"",null,null,"","0","","0","",true,0,"1","","0",2,null,"","0","","0","",true,"","0",0,"1",2,null,"  ","  "]
[null,null,null,{"$f":"IF(C46=\"\",\"\",VLOOKUP($C46,Lookup!$B$2:$E$49,2,FALSE))","v":""},{"$f":"IF(C46=\"\",\"\",VLOOKUP($C46,Lookup!$B$2:$E$49,3,FALSE))","v":""},null,null,null,"",null,"",null,"",null,"",null,null,"","0","","0","",true,0,"1","","0",2,null,"","0","","0","",true,"","0",0,"1",2,null,"  ","  "]
[null,null,null,{"$f":"IF(C47=\"\",\"\",VLOOKUP($C47,Lookup!$B$2:$E$49,2,FALSE))","v":""},{"$f":"IF(C47=\"\",\"\",VLOOKUP($C47,Lookup!$B$2:$E$49,3,FALSE))","v":""},null,null,null,"",null,"",null,"",null,"",null,null,"","0","","0","",true,0,"1","","0",2,null,"","0","","0","",true,"","0",0,"1",2,null,"  ","  "]
[null,null,null,{"$f":"IF(C48=\"\",\"\",VLOOKUP($C48,Lookup!$B$2:$E$49,2,FALSE))","v":""},{"$f":"IF(C48=\"\",\"\",VLOOKUP($C48,Lookup!$B$2:$E$49,3,FALSE))","v":""},null,null,null,"",null,"",null,"",null,"",null,null,"","0","","0","",true,0,"1","","0",2,null,"","0","","0","",true,"","0",0,"1",2,null,"  ","  "]
[null,null,null,{"$f":"IF(C49=\"\",\"\",VLOOKUP($C49,Lookup!$B$2:$E$49,2,FALSE))","v":""},{"$f":"IF(C49=\"\",\"\",VLOOKUP($C49,Lookup!$B$2:$E$49,3,FALSE))","v":""},null,null,null,"",null,"",null,"",null,"",null,null,"","0","","0","",true,0,"1","","0",2,null,"","0","","0","",true,"","0",0,"1",2,null,"  ","  "]
[null,null,null,{"$f":"IF(C50=\"\",\"\",VLOOKUP($C50,Lookup!$B$2:$E$49,2,FALSE))","v":""},{"$f":"IF(C50=\"\",\"\",VLOOKUP($C50,Lookup!$B$2:$E$49,3,FALSE))","v":""},null,null,null,"",null,"",null,"",null,"",null,null,"","0","","0","",true,0,"1","","0",2,null,"","0","","0","",true,"","0",0,"1",2,null,"  ","  "]
[null,null,null,{"$f":"IF(C51=\"\",\"\",VLOOKUP($C51,Lookup!$B$2:$E$49,2,FALSE))","v":""},{"$f":"IF(C51=\"\",\"\",VLOOKUP($C51,Lookup!$B$2:$E$49,3,FALSE))","v":""},null,null,null,"",null,"",null,"",null,"",null,null,"","0","","0","",true,0,"1","","0",2,null,"","0","","0","",true,"","0",0,"1",2,null,"  ","  "]
[null,null,null,{"$f":"IF(C52=\"\",\"\",VLOOKUP($C52,Lookup!$B$2:$E$49,2,FALSE))","v":""},{"$f":"IF(C52=\"\",\"\",VLOOKUP($C52,Lookup!$B$2:$E$49,3,FALSE))","v":""},null,null,null,"",null,"",null,"",null,"",null,null,"","0","","0","",true,0,"1","","0",2,null,"","0","","0","",true,"","0",0,"1",2,null,"  ","  "]
[null,null,null,{"$f":"IF(C53=\"\",\"\",VLOOKUP($C53,Lookup!$B$2:$E$49,2,FALSE))","v":""},{"$f":"IF(C53=\"\",\"\",VLOOKUP($C53,Lookup!$B$2:$E$49,3,FALSE))","v":""},null,null,null,"",null,"",null,"",null,"",null,null,"","0","","0","",true,0,"1","","0",2,null,"","0","","0","",true,"","0",0,"1",2,null,"  ","  "]
[null,null,null,{"$f":"IF(C54=\"\",\"\",VLOOKUP($C54,Lookup!$B$2:$E$49,2,FALSE))","v":""},{"$f":"IF(C54=\"\",\"\",VLOOKUP($C54,Lookup!$B$2:$E$49,3,FALSE))","v":""},null,null,null,"",null,"",null,"",null,"",null,null,"","0","","0","",true,0,"1","","0",2,null,"","0","","0","",true,"","0",0,"1",2,null,"  ","  "]
[null,null,null,{"$f":"IF(C55=\"\",\"\",VLOOKUP($C55,Lookup!$B$2:$E$49,2,FALSE))","v":""},{"$f":"IF(C55=\"\",\"\",VLOOKUP($C55,Lookup!$B$2:$E$49,3,FALSE))","v":""},null,null,null,"",null,"",null,"",null,"",null,null,"","0","","0","",true,0,"1","","0",2,null,"","0","","0","",true,"","0",0,"1",2,null,"  ","  "]
[null,null,null,{"$f":"IF(C56=\"\",\"\",VLOOKUP($C56,Lookup!$B$2:$E$49,2,FALSE))","v":""},{"$f":"IF(C56=\"\",\"\",VLOOKUP($C56,Lookup!$B$2:$E$49,3,FALSE))","v":""},null,null,null,"",null,"",null,"",null,"",null,null,"","0","","0","",true,0,"1","","0",2,null,"","0","","0","",true,"","0",0,"1",2,null,"  ","  "]
[null,null,null,{"$f":"IF(C57=\"\",\"\",VLOOKUP($C57,Lookup!$B$2:$E$49,2,FALSE))","v":""},{"$f":"IF(C57=\"\",\"\",VLOOKUP($C57,Lookup!$B$2:$E$49,3,FALSE))","v":""},null,null,null,"",null,"",null,"",null,"",null,null,"","0","","0","",true,0,"1","","0",2,null,"","0","","0","",true,"","0",0,"1",2,null,"  ","  "]
[null,null,null,{"$f":"IF(C58=\"\",\"\",VLOOKUP($C58,Lookup!$B$2:$E$49,2,FALSE))","v":""},{"$f":"IF(C58=\"\",\"\",VLOOKUP($C58,Lookup!$B$2:$E$49,3,FALSE))","v":""},null,null,null,"",null,"",null,"",null,"",null,null,"","0","","0","",true,0,"1","","0",2,null,"","0","","0","",true,"","0",0,"1",2,null,"  ","  "]
[null,null,null,{"$f":"IF(C59=\"\",\"\",VLOOKUP($C59,Lookup!$B$2:$E$49,2,FALSE))","v":""},{"$f":"IF(C59=\"\",\"\",VLOOKUP($C59,Lookup!$B$2:$E$49,3,FALSE))","v":""},null,null,null,"",null,"",null,"",null,"",null,null,"","0","","0","",true,0,"1","","0",2,null,"","0","","0","",true,"","0",0,"1",2,null,"  ","  "]
[null,null,null,{"$f":"IF(C60=\"\",\"\",VLOOKUP($C60,Lookup!$B$2:$E$49,2,FALSE))","v":""},{"$f":"IF(C60=\"\",\"\",VLOOKUP($C60,Lookup!$B$2:$E$49,3,FALSE))","v":""},null,null,null,"",null,"",null,"",null,"",null,null,"","0","","0","",true,0,"1","","0",2,null,"","0","","0","",true,"","0",0,"1",2,null,"  ","  "]
[null,null,null,{"$f":"IF(C61=\"\",\"\",VLOOKUP($C61,Lookup!$B$2:$E$49,2,FALSE))","v":""},{"$f":"IF(C61=\"\",\"\",VLOOKUP($C61,Lookup!$B$2:$E$49,3,FALSE))","v":""},null,null,null,"",null,"",null,"",null,"",null,null,"","0","","0","",true,0,"1","","0",2,null,"","0","","0","",true,"","0",0,"1",2,null,"  ","  "]
[null,null,null,{"$f":"IF(C62=\"\",\"\",VLOOKUP($C62,Lookup!$B$2:$E$49,2,FALSE))","v":""},{"$f":"IF(C62=\"\",\"\",VLOOKUP($C62,Lookup!$B$2:$E$49,3,FALSE))","v":""},null,null,null,"",null,"",null,"",null,"",null,null,"","0","","0","",true,0,"1","","0",2,null,"","0","","0","",true,"","0",0,"1",2,null,"  ","  "]
[null,null,null,{"$f":"IF(C63=\"\",\"\",VLOOKUP($C63,Lookup!$B$2:$E$49,2,FALSE))","v":""},{"$f":"IF(C63=\"\",\"\",VLOOKUP($C63,Lookup!$B$2:$E$49,3,FALSE))","v":""},null,null,null,"",null,"",null,"",null,"",null,null,"","0","","0","",true,0,"1","","0",2,null,"","0","","0","",true,"","0",0,"1",2,null,"  ","  "]
[null,null,null,{"$f":"IF(C64=\"\",\"\",VLOOKUP($C64,Lookup!$B$2:$E$49,2,FALSE))","v":""},{"$f":"IF(C64=\"\",\"\",VLOOKUP($C64,Lookup!$B$2:$E$49,3,FALSE))","v":""},null,null,null,"",null,"",null,"",null,"",null,null,"","0","","0","",true,0,"1","","0",2,null,"","0","","0","",true,"","0",0,"1",2,null,"  ","  "]
[null,null,null,{"$f":"IF(C65=\"\",\"\",VLOOKUP($C65,Lookup!$B$2:$E$49,2,FALSE))","v":""},{"$f":"IF(C65=\"\",\"\",VLOOKUP($C65,Lookup!$B$2:$E$49,3,FALSE))","v":""},null,null,null,"",null,"",null,"",null,"",null,null,"","0","","0","",true,0,"1","","0",2,null,"","0","","0","",true,"","0",0,"1",2,null,"  ","  "]
[null,null,null,{"$f":"IF(C66=\"\",\"\",VLOOKUP($C66,Lookup!$B$2:$E$49,2,FALSE))","v":""},{"$f":"IF(C66=\"\",\"\",VLOOKUP($C66,Lookup!$B$2:$E$49,3,FALSE))","v":""},null,null,null,"",null,"",null,"",null,"",null,null,"","0","","0","",true,0,"1","","0",2,null,"","0","","0","",true,"","0",0,"1",2,null,"  ","  "]
[null,null,null,{"$f":"IF(C67=\"\",\"\",VLOOKUP($C67,Lookup!$B$2:$E$49,2,FALSE))","v":""},{"$f":"IF(C67=\"\",\"\",VLOOKUP($C67,Lookup!$B$2:$E$49,3,FALSE))","v":""},null,null,null,"",null,"",null,"",null,"",null,null,"","0","","0","",true,0,"1","","0",2,null,"","0","","0","",true,"","0",0,"1",2,null,"  ","  "]
[null,null,null,{"$f":"IF(C68=\"\",\"\",VLOOKUP($C68,Lookup!$B$2:$E$49,2,FALSE))","v":""},{"$f":"IF(C68=\"\",\"\",VLOOKUP($C68,Lookup!$B$2:$E$49,3,FALSE))","v":""},null,null,null,"",null,"",null,"",null,"",null,null,"","0","","0","",true,0,"1","","0",2,null,"","0","","0","",true,"","0",0,"1",2,null,"  ","  "]
[null,null,null,{"$f":"IF(C69=\"\",\"\",VLOOKUP($C69,Lookup!$B$2:$E$49,2,FALSE))","v":""},{"$f":"IF(C69=\"\",\"\",VLOOKUP($C69,Lookup!$B$2:$E$49,3,FALSE))","v":""},null,null,null,"",null,"",null,"",null,"",null,null,"","0","","0","",true,0,"1","","0",2,null,"","0","","0","",true,"","0",0,"1",2,null,"  ","  "]
[null,null,null,{"$f":"IF(C70=\"\",\"\",VLOOKUP($C70,Lookup!$B$2:$E$49,2,FALSE))","v":""},{"$f":"IF(C70=\"\",\"\",VLOOKUP($C70,Lookup!$B$2:$E$49,3,FALSE))","v":""},null,null,null,{"$f":"IF(H70=\"\",\"\",IF(AB70+0>0,\"r\",IF(AB70+0=0,\"a\",\"\")))","v":""},null,{"$f":"IF(H70=\"\",\"\",IF(H70=J70,\"a\",\"r\"))","v":""},null,{"$f":"IF(L70=\"\",\"\",IF(AN70+0>0,\"r\",IF(AN70+0=0,\"a\",\"\")))","v":""},null,{"$f":"IF(L70=\"\",\"\",IF(L70=N70,\"a\",\"r\"))","v":""},null,null,{"$f":"IF(H70=\"\",\"\",LEFT(H70,2)+0)","v":""},{"$f":"IF(H70=\"\",\"0\",IF(AND(R70>=40,R70<=70),\"0\",\"1\"))","v":"0"},{"$f":"IF(H70=\"\",\"\",MID(H70,3,2)+0)","v":""},{"$f":"IF(H70=\"\",\"0\",IF(T70>59,\"1\",\"0\"))","v":"0"},{"$f":"IF(H70=\"\",\"\",MID(H70,5,5)+0)","v":""},{"$f":"IFERROR(V70>60,\"1\")","v":true},{"$f":"LEN(H70)","v":0},{"$f":"IF(X70<10,\"1\",\"0\")","v":"1"},{"$f":"RIGHT(H70,1)","v":""},{"$f":"IF(Z70=\"\",\"0\",IF(Z70=\"N\",\"0\",\"1\"))","v":"0"},{"$f":"S70+U70++Y70+W70+AA70","v":2},null,{"$f":"IF(L70=\"\",\"\",LEFT(L70,3)+0)","v":""},{"$f":"IF(L70=\"\",\"0\",IF(AD70>20,\"1\",\"0\"))","v":"0"},{"$f":"IF(L70=\"\",\"\",MID(L70,4,2)+0)","v":""},{"$f":"IF(L70=\"\",\"0\",IF(AF70>59,\"1\",\"0\"))","v":"0"},{"$f":"IF(L70=\"\",\"\",MID(L70,6,5)+0)","v":""},{"$f":"IFERROR(AH70>60,\"1\")","v":true},{"$f":"RIGHT(L70,1)","v":""},{"$f":"IF(L70=\"\",\"0\",IF(AJ70=\"W\",\"0\",IF(AJ70=\"E\",\"0\",\"1\")))","v":"0"},{"$f":"LEN(L70)","v":0},{"$f":"IF(AL70<11,\"1\",\"0\")","v":"1"},{"$f":"AE70+AG70+AI70+AK70+AM70","v":2},null,{"$f":"LEFT(H70,2)&\" \"& MID(H70,3,2)&\" \"&MID(H70,5,10)","v":"  "},{"$f":"LEFT(L70,3)&\" \"& MID(L70,4,2)&\" \"&MID(L70,6,10)","v":"  "}]
[null,null,null,{"$f":"IF(C71=\"\",\"\",VLOOKUP($C71,Lookup!$B$2:$E$49,2,FALSE))","v":""},{"$f":"IF(C71=\"\",\"\",VLOOKUP($C71,Lookup!$B$2:$E$49,3,FALSE))","v":""},null,null,null,"",null,"",null,"",null,"",null,null,"","0","","0","",true,0,"1","","0",2,null,"","0","","0","",true,"","0",0,"1",2,null,"  ","  "]
[null,null,null,{"$f":"IF(C72=\"\",\"\",VLOOKUP($C72,Lookup!$B$2:$E$49,2,FALSE))","v":""},{"$f":"IF(C72=\"\",\"\",VLOOKUP($C72,Lookup!$B$2:$E$49,3,FALSE))","v":""},null,null,null,"",null,"",null,"",null,"",null,null,"","0","","0","",true,0,"1","","0",2,null,"","0","","0","",true,"","0",0,"1",2,null,"  ","  "]
[null,null,null,{"$f":"IF(C73=\"\",\"\",VLOOKUP($C73,Lookup!$B$2:$E$49,2,FALSE))","v":""},{"$f":"IF(C73=\"\",\"\",VLOOKUP($C73,Lookup!$B$2:$E$49,3,FALSE))","v":""},null,null,null,"",null,"",null,"",null,"",null,null,"","0","","0","",true,0,"1","","0",2,null,"","0","","0","",true,"","0",0,"1",2,null,"  ","  "]
[null,null,null,{"$f":"IF(C74=\"\",\"\",VLOOKUP($C74,Lookup!$B$2:$E$49,2,FALSE))","v":""},{"$f":"IF(C74=\"\",\"\",VLOOKUP($C74,Lookup!$B$2:$E$49,3,FALSE))","v":""},null,null,null,"",null,"",null,"",null,"",null,null,"","0","","0","",true,0,"1","","0",2,null,"","0","","0","",true,"","0",0,"1",2,null,"  ","  "]
[null,null,null,{"$f":"IF(C75=\"\",\"\",VLOOKUP($C75,Lookup!$B$2:$E$49,2,FALSE))","v":""},{"$f":"IF(C75=\"\",\"\",VLOOKUP($C75,Lookup!$B$2:$E$49,3,FALSE))","v":""},null,null,null,"",null,"",null,"",null,"",null,null,"","0","","0","",true,0,"1","","0",2,null,"","0","","0","",true,"","0",0,"1",2,null,"  ","  "]
[null,null,null,{"$f":"IF(C76=\"\",\"\",VLOOKUP($C76,Lookup!$B$2:$E$49,2,FALSE))","v":""},{"$f":"IF(C76=\"\",\"\",VLOOKUP($C76,Lookup!$B$2:$E$49,3,FALSE))","v":""},null,null,null,"",null,"",null,"",null,"",null,null,"","0","","0","",true,0,"1","","0",2,null,"","0","","0","",true,"","0",0,"1",2,null,"  ","  "]
[null,null,null,{"$f":"IF(C77=\"\",\"\",VLOOKUP($C77,Lookup!$B$2:$E$49,2,FALSE))","v":""},{"$f":"IF(C77=\"\",\"\",VLOOKUP($C77,Lookup!$B$2:$E$49,3,FALSE))","v":""},null,null,null,"",null,"",null,"",null,"",null,null,"","0","","0","",true,0,"1","","0",2,null,"","0","","0","",true,"","0",0,"1",2,null,"  ","  "]
[null,null,null,{"$f":"IF(C78=\"\",\"\",VLOOKUP($C78,Lookup!$B$2:$E$49,2,FALSE))","v":""},{"$f":"IF(C78=\"\",\"\",VLOOKUP($C78,Lookup!$B$2:$E$49,3,FALSE))","v":""},null,null,null,"",null,"",null,"",null,"",null,null,"","0","","0","",true,0,"1","","0",2,null,"","0","","0","",true,"","0",0,"1",2,null,"  ","  "]
[null,null,null,{"$f":"IF(C79=\"\",\"\",VLOOKUP($C79,Lookup!$B$2:$E$49,2,FALSE))","v":""},{"$f":"IF(C79=\"\",\"\",VLOOKUP($C79,Lookup!$B$2:$E$49,3,FALSE))","v":""},null,null,null,"",null,"",null,"",null,"",null,null,"","0","","0","",true,0,"1","","0",2,null,"","0","","0","",true,"","0",0,"1",2,null,"  ","  "]
[null,null,null,{"$f":"IF(C80=\"\",\"\",VLOOKUP($C80,Lookup!$B$2:$E$49,2,FALSE))","v":""},{"$f":"IF(C80=\"\",\"\",VLOOKUP($C80,Lookup!$B$2:$E$49,3,FALSE))","v":""},null,null,null,"",null,"",null,"",null,"",null,null,"","0","","0","",true,0,"1","","0",2,null,"","0","","0","",true,"","0",0,"1",2,null,"  ","  "]
[null,null,null,{"$f":"IF(C81=\"\",\"\",VLOOKUP($C81,Lookup!$B$2:$E$49,2,FALSE))","v":""},{"$f":"IF(C81=\"\",\"\",VLOOKUP($C81,Lookup!$B$2:$E$49,3,FALSE))","v":""},null,null,null,"",null,"",null,"",null,"",null,null,"","0","","0","",true,0,"1","","0",2,null,"","0","","0","",true,"","0",0,"1",2,null,"  ","  "]
[null,null,null,{"$f":"IF(C82=\"\",\"\",VLOOKUP($C82,Lookup!$B$2:$E$49,2,FALSE))","v":""},{"$f":"IF(C82=\"\",\"\",VLOOKUP($C82,Lookup!$B$2:$E$49,3,FALSE))","v":""},null,null,null,"",null,"",null,"",null,"",null,null,"","0","","0","",true,0,"1","","0",2,null,"","0","","0","",true,"","0",0,"1",2,null,"  ","  "]
[null,null,null,{"$f":"IF(C83=\"\",\"\",VLOOKUP($C83,Lookup!$B$2:$E$49,2,FALSE))","v":""},{"$f":"IF(C83=\"\",\"\",VLOOKUP($C83,Lookup!$B$2:$E$49,3,FALSE))","v":""},null,null,null,"",null,"",null,"",null,"",null,null,"","0","","0","",true,0,"1","","0",2,null,"","0","","0","",true,"","0",0,"1",2,null,"  ","  "]
[null,null,null,{"$f":"IF(C84=\"\",\"\",VLOOKUP($C84,Lookup!$B$2:$E$49,2,FALSE))","v":""},{"$f":"IF(C84=\"\",\"\",VLOOKUP($C84,Lookup!$B$2:$E$49,3,FALSE))","v":""},null,null,null,"",null,"",null,"",null,"",null,null,"","0","","0","",true,0,"1","","0",2,null,"","0","","0","",true,"","0",0,"1",2,null,"  ","  "]
[null,null,null,{"$f":"IF(C85=\"\",\"\",VLOOKUP($C85,Lookup!$B$2:$E$49,2,FALSE))","v":""},{"$f":"IF(C85=\"\",\"\",VLOOKUP($C85,Lookup!$B$2:$E$49,3,FALSE))","v":""},null,null,null,"",null,"",null,"",null,"",null,null,"","0","","0","",true,0,"1","","0",2,null,"","0","","0","",true,"","0",0,"1",2,null,"  ","  "]
[null,null,null,{"$f":"IF(C86=\"\",\"\",VLOOKUP($C86,Lookup!$B$2:$E$49,2,FALSE))","v":""},{"$f":"IF(C86=\"\",\"\",VLOOKUP($C86,Lookup!$B$2:$E$49,3,FALSE))","v":""},null,null,null,"",null,"",null,"",null,"",null,null,"","0","","0","",true,0,"1","","0",2,null,"","0","","0","",true,"","0",0,"1",2,null,"  ","  "]
[null,null,null,{"$f":"IF(C87=\"\",\"\",VLOOKUP($C87,Lookup!$B$2:$E$49,2,FALSE))","v":""},{"$f":"IF(C87=\"\",\"\",VLOOKUP($C87,Lookup!$B$2:$E$49,3,FALSE))","v":""},null,null,null,"",null,"",null,"",null,"",null,null,"","0","","0","",true,0,"1","","0",2,null,"","0","","0","",true,"","0",0,"1",2,null,"  ","  "]
[null,null,null,{"$f":"IF(C88=\"\",\"\",VLOOKUP($C88,Lookup!$B$2:$E$49,2,FALSE))","v":""},{"$f":"IF(C88=\"\",\"\",VLOOKUP($C88,Lookup!$B$2:$E$49,3,FALSE))","v":""},null,null,null,"",null,"",null,"",null,"",null,null,"","0","","0","",true,0,"1","","0",2,null,"","0","","0","",true,"","0",0,"1",2,null,"  ","  "]
[null,null,null,{"$f":"IF(C89=\"\",\"\",VLOOKUP($C89,Lookup!$B$2:$E$49,2,FALSE))","v":""},{"$f":"IF(C89=\"\",\"\",VLOOKUP($C89,Lookup!$B$2:$E$49,3,FALSE))","v":""},null,null,null,"",null,"",null,"",null,"",null,null,"","0","","0","",true,0,"1","","0",2,null,"","0","","0","",true,"","0",0,"1",2,null,"  ","  "]
[null,null,null,{"$f":"IF(C90=\"\",\"\",VLOOKUP($C90,Lookup!$B$2:$E$49,2,FALSE))","v":""},{"$f":"IF(C90=\"\",\"\",VLOOKUP($C90,Lookup!$B$2:$E$49,3,FALSE))","v":""},null,null,null,"",null,"",null,"",null,"",null,null,"","0","","0","",true,0,"1","","0",2,null,"","0","","0","",true,"","0",0,"1",2,null,"  ","  "]
[null,null,null,{"$f":"IF(C91=\"\",\"\",VLOOKUP($C91,Lookup!$B$2:$E$49,2,FALSE))","v":""},{"$f":"IF(C91=\"\",\"\",VLOOKUP($C91,Lookup!$B$2:$E$49,3,FALSE))","v":""},null,null,null,"",null,"",null,"",null,"",null,null,"","0","","0","",true,0,"1","","0",2,null,"","0","","0","",true,"","0",0,"1",2,null,"  ","  "]
[null,null,null,{"$f":"IF(C92=\"\",\"\",VLOOKUP($C92,Lookup!$B$2:$E$49,2,FALSE))","v":""},{"$f":"IF(C92=\"\",\"\",VLOOKUP($C92,Lookup!$B$2:$E$49,3,FALSE))","v":""},null,null,null,"",null,"",null,"",null,"",null,null,"","0","","0","",true,0,"1","","0",2,null,"","0","","0","",true,"","0",0,"1",2,null,"  ","  "]
[null,null,null,{"$f":"IF(C93=\"\",\"\",VLOOKUP($C93,Lookup!$B$2:$E$49,2,FALSE))","v":""},{"$f":"IF(C93=\"\",\"\",VLOOKUP($C93,Lookup!$B$2:$E$49,3,FALSE))","v":""},null,null,null,"",null,"",null,"",null,"",null,null,"","0","","0","",true,0,"1","","0",2,null,"","0","","0","",true,"","0",0,"1",2,null,"  ","  "]
[null,null,null,{"$f":"IF(C94=\"\",\"\",VLOOKUP($C94,Lookup!$B$2:$E$49,2,FALSE))","v":""},{"$f":"IF(C94=\"\",\"\",VLOOKUP($C94,Lookup!$B$2:$E$49,3,FALSE))","v":""},null,null,null,"",null,"",null,"",null,"",null,null,"","0","","0","",true,0,"1","","0",2,null,"","0","","0","",true,"","0",0,"1",2,null,"  ","  "]
[null,null,null,{"$f":"IF(C95=\"\",\"\",VLOOKUP($C95,Lookup!$B$2:$E$49,2,FALSE))","v":""},{"$f":"IF(C95=\"\",\"\",VLOOKUP($C95,Lookup!$B$2:$E$49,3,FALSE))","v":""},null,null,null,"",null,"",null,"",null,"",null,null,"","0","","0","",true,0,"1","","0",2,null,"","0","","0","",true,"","0",0,"1",2,null,"  ","  "]
[null,null,null,{"$f":"IF(C96=\"\",\"\",VLOOKUP($C96,Lookup!$B$2:$E$49,2,FALSE))","v":""},{"$f":"IF(C96=\"\",\"\",VLOOKUP($C96,Lookup!$B$2:$E$49,3,FALSE))","v":""},null,null,null,"",null,"",null,"",null,"",null,null,"","0","","0","",true,0,"1","","0",2,null,"","0","","0","",true,"","0",0,"1",2,null,"  ","  "]
[null,null,null,{"$f":"IF(C97=\"\",\"\",VLOOKUP($C97,Lookup!$B$2:$E$49,2,FALSE))","v":""},{"$f":"IF(C97=\"\",\"\",VLOOKUP($C97,Lookup!$B$2:$E$49,3,FALSE))","v":""},null,null,null,"",null,"",null,"",null,"",null,null,"","0","","0","",true,0,"1","","0",2,null,"","0","","0","",true,"","0",0,"1",2,null,"  ","  "]
[null,null,null,{"$f":"IF(C98=\"\",\"\",VLOOKUP($C98,Lookup!$B$2:$E$49,2,FALSE))","v":""},{"$f":"IF(C98=\"\",\"\",VLOOKUP($C98,Lookup!$B$2:$E$49,3,FALSE))","v":""},null,null,null,"",null,"",null,"",null,"",null,null,"","0","","0","",true,0,"1","","0",2,null,"","0","","0","",true,"","0",0,"1",2,null,"  ","  "]
[null,null,null,{"$f":"IF(C99=\"\",\"\",VLOOKUP($C99,Lookup!$B$2:$E$49,2,FALSE))","v":""},{"$f":"IF(C99=\"\",\"\",VLOOKUP($C99,Lookup!$B$2:$E$49,3,FALSE))","v":""},null,null,null,"",null,"",null,"",null,"",null,null,"","0","","0","",true,0,"1","","0",2,null,"","0","","0","",true,"","0",0,"1",2,null,"  ","  "]
[null,null,null,{"$f":"IF(C100=\"\",\"\",VLOOKUP($C100,Lookup!$B$2:$E$49,2,FALSE))","v":""},{"$f":"IF(C100=\"\",\"\",VLOOKUP($C100,Lookup!$B$2:$E$49,3,FALSE))","v":""},null,null,null,"",null,"",null,"",null,"",null,null,"","0","","0","",true,0,"1","","0",2,null,"","0","","0","",true,"","0",0,"1",2,null,"  ","  "]
[null,null,null,{"$f":"IF(C101=\"\",\"\",VLOOKUP($C101,Lookup!$B$2:$E$49,2,FALSE))","v":""},{"$f":"IF(C101=\"\",\"\",VLOOKUP($C101,Lookup!$B$2:$E$49,3,FALSE))","v":""},null,null,null,"",null,"",null,"",null,"",null,null,"","0","","0","",true,0,"1","","0",2,null,"","0","","0","",true,"","0",0,"1",2,null,"  ","  "]
[null,null,null,{"$f":"IF(C102=\"\",\"\",VLOOKUP($C102,Lookup!$B$2:$E$49,2,FALSE))","v":""},{"$f":"IF(C102=\"\",\"\",VLOOKUP($C102,Lookup!$B$2:$E$49,3,FALSE))","v":""},null,null,null,"",null,"",null,"",null,"",null,null,"","0","","0","",true,0,"1","","0",2,null,"","0","","0","",true,"","0",0,"1",2,null,"  ","  "]
[null,null,null,{"$f":"IF(C103=\"\",\"\",VLOOKUP($C103,Lookup!$B$2:$E$49,2,FALSE))","v":""},{"$f":"IF(C103=\"\",\"\",VLOOKUP($C103,Lookup!$B$2:$E$49,3,FALSE))","v":""},null,null,null,"",null,"",null,"",null,"",null,null,"","0","","0","",true,0,"1","","0",2,null,"","0","","0","",true,"","0",0,"1",2,null,"  ","  "]
[null,null,null,{"$f":"IF(C104=\"\",\"\",VLOOKUP($C104,Lookup!$B$2:$E$49,2,FALSE))","v":""},{"$f":"IF(C104=\"\",\"\",VLOOKUP($C104,Lookup!$B$2:$E$49,3,FALSE))","v":""},null,null,null,"",null,"",null,"",null,"",null,null,"","0","","0","",true,0,"1","","0",2,null,"","0","","0","",true,"","0",0,"1",2,null,"  ","  "]
[null,null,null,{"$f":"IF(C105=\"\",\"\",VLOOKUP($C105,Lookup!$B$2:$E$49,2,FALSE))","v":""},{"$f":"IF(C105=\"\",\"\",VLOOKUP($C105,Lookup!$B$2:$E$49,3,FALSE))","v":""},null,null,null,"",null,"",null,"",null,"",null,null,"","0","","0","",true,0,"1","","0",2,null,"","0","","0","",true,"","0",0,"1",2,null,"  ","  "]
[null,null,null,{"$f":"IF(C106=\"\",\"\",VLOOKUP($C106,Lookup!$B$2:$E$49,2,FALSE))","v":""},{"$f":"IF(C106=\"\",\"\",VLOOKUP($C106,Lookup!$B$2:$E$49,3,FALSE))","v":""},null,null,null,"",null,"",null,"",null,"",null,null,"","0","","0","",true,0,"1","","0",2,null,"","0","","0","",true,"","0",0,"1",2,null,"  ","  "]
[null,null,null,{"$f":"IF(C107=\"\",\"\",VLOOKUP($C107,Lookup!$B$2:$E$49,2,FALSE))","v":""},{"$f":"IF(C107=\"\",\"\",VLOOKUP($C107,Lookup!$B$2:$E$49,3,FALSE))","v":""},null,null,null,"",null,"",null,"",null,"",null,null,"","0","","0","",true,0,"1","","0",2,null,"","0","","0","",true,"","0",0,"1",2,null,"  ","  "]
[null,null,null,{"$f":"IF(C108=\"\",\"\",VLOOKUP($C108,Lookup!$B$2:$E$49,2,FALSE))","v":""},{"$f":"IF(C108=\"\",\"\",VLOOKUP($C108,Lookup!$B$2:$E$49,3,FALSE))","v":""},null,null,null,"",null,"",null,"",null,"",null,null,"","0","","0","",true,0,"1","","0",2,null,"","0","","0","",true,"","0",0,"1",2,null,"  ","  "]
[null,null,null,{"$f":"IF(C109=\"\",\"\",VLOOKUP($C109,Lookup!$B$2:$E$49,2,FALSE))","v":""},{"$f":"IF(C109=\"\",\"\",VLOOKUP($C109,Lookup!$B$2:$E$49,3,FALSE))","v":""},null,null,null,"",null,"",null,"",null,"",null,null,"","0","","0","",true,0,"1","","0",2,null,"","0","","0","",true,"","0",0,"1",2,null,"  ","  "]
[null,null,null,{"$f":"IF(C110=\"\",\"\",VLOOKUP($C110,Lookup!$B$2:$E$49,2,FALSE))","v":""},{"$f":"IF(C110=\"\",\"\",VLOOKUP($C110,Lookup!$B$2:$E$49,3,FALSE))","v":""},null,null,null,"",null,"",null,"",null,"",null,null,"","0","","0","",true,0,"1","","0",2,null,"","0","","0","",true,"","0",0,"1",2,null,"  ","  "]
[null,null,null,{"$f":"IF(C111=\"\",\"\",VLOOKUP($C111,Lookup!$B$2:$E$49,2,FALSE))","v":""},{"$f":"IF(C111=\"\",\"\",VLOOKUP($C111,Lookup!$B$2:$E$49,3,FALSE))","v":""},null,null,null,"",null,"",null,"",null,"",null,null,"","0","","0","",true,0,"1","","0",2,null,"","0","","0","",true,"","0",0,"1",2,null,"  ","  "]
[null,null,null,{"$f":"IF(C112=\"\",\"\",VLOOKUP($C112,Lookup!$B$2:$E$49,2,FALSE))","v":""},{"$f":"IF(C112=\"\",\"\",VLOOKUP($C112,Lookup!$B$2:$E$49,3,FALSE))","v":""},null,null,null,"",null,"",null,"",null,"",null,null,"","0","","0","",true,0,"1","","0",2,null,"","0","","0","",true,"","0",0,"1",2,null,"  ","  "]
[null,null,null,{"$f":"IF(C113=\"\",\"\",VLOOKUP($C113,Lookup!$B$2:$E$49,2,FALSE))","v":""},{"$f":"IF(C113=\"\",\"\",VLOOKUP($C113,Lookup!$B$2:$E$49,3,FALSE))","v":""},null,null,null,"",null,"",null,"",null,"",null,null,"","0","","0","",true,0,"1","","0",2,null,"","0","","0","",true,"","0",0,"1",2,null,"  ","  "]
[null,null,null,{"$f":"IF(C114=\"\",\"\",VLOOKUP($C114,Lookup!$B$2:$E$49,2,FALSE))","v":""},{"$f":"IF(C114=\"\",\"\",VLOOKUP($C114,Lookup!$B$2:$E$49,3,FALSE))","v":""},null,null,null,"",null,"",null,"",null,"",null,null,"","0","","0","",true,0,"1","","0",2,null,"","0","","0","",true,"","0",0,"1",2,null,"  ","  "]
[null,null,null,{"$f":"IF(C115=\"\",\"\",VLOOKUP($C115,Lookup!$B$2:$E$49,2,FALSE))","v":""},{"$f":"IF(C115=\"\",\"\",VLOOKUP($C115,Lookup!$B$2:$E$49,3,FALSE))","v":""},null,null,null,"",null,"",null,"",null,"",null,null,"","0","","0","",true,0,"1","","0",2,null,"","0","","0","",true,"","0",0,"1",2,null,"  ","  "]
[null,null,null,{"$f":"IF(C116=\"\",\"\",VLOOKUP($C116,Lookup!$B$2:$E$49,2,FALSE))","v":""},{"$f":"IF(C116=\"\",\"\",VLOOKUP($C116,Lookup!$B$2:$E$49,3,FALSE))","v":""},null,null,null,"",null,"",null,"",null,"",null,null,"","0","","0","",true,0,"1","","0",2,null,"","0","","0","",true,"","0",0,"1",2,null,"  ","  "]
[null,null,null,{"$f":"IF(C117=\"\",\"\",VLOOKUP($C117,Lookup!$B$2:$E$49,2,FALSE))","v":""},{"$f":"IF(C117=\"\",\"\",VLOOKUP($C117,Lookup!$B$2:$E$49,3,FALSE))","v":""},null,null,null,"",null,"",null,"",null,"",null,null,"","0","","0","",true,0,"1","","0",2,null,"","0","","0","",true,"","0",0,"1",2,null,"  ","  "]
[null,null,null,{"$f":"IF(C118=\"\",\"\",VLOOKUP($C118,Lookup!$B$2:$E$49,2,FALSE))","v":""},{"$f":"IF(C118=\"\",\"\",VLOOKUP($C118,Lookup!$B$2:$E$49,3,FALSE))","v":""},null,null,null,"",null,"",null,"",null,"",null,null,"","0","","0","",true,0,"1","","0",2,null,"","0","","0","",true,"","0",0,"1",2,null,"  ","  "]
[null,null,null,{"$f":"IF(C119=\"\",\"\",VLOOKUP($C119,Lookup!$B$2:$E$49,2,FALSE))","v":""},{"$f":"IF(C119=\"\",\"\",VLOOKUP($C119,Lookup!$B$2:$E$49,3,FALSE))","v":""},null,null,null,"",null,"",null,"",null,"",null,null,"","0","","0","",true,0,"1","","0",2,null,"","0","","0","",true,"","0",0,"1",2,null,"  ","  "]
[null,null,null,{"$f":"IF(C120=\"\",\"\",VLOOKUP($C120,Lookup!$B$2:$E$49,2,FALSE))","v":""},{"$f":"IF(C120=\"\",\"\",VLOOKUP($C120,Lookup!$B$2:$E$49,3,FALSE))","v":""},null,null,null,"",null,"",null,"",null,"",null,null,"","0","","0","",true,0,"1","","0",2,null,"","0","","0","",true,"","0",0,"1",2,null,"  ","  "]
[null,null,null,{"$f":"IF(C121=\"\",\"\",VLOOKUP($C121,Lookup!$B$2:$E$49,2,FALSE))","v":""},{"$f":"IF(C121=\"\",\"\",VLOOKUP($C121,Lookup!$B$2:$E$49,3,FALSE))","v":""},null,null,null,"",null,"",null,"",null,"",null,null,"","0","","0","",true,0,"1","","0",2,null,"","0","","0","",true,"","0",0,"1",2,null,"  ","  "]
[null,null,null,{"$f":"IF(C122=\"\",\"\",VLOOKUP($C122,Lookup!$B$2:$E$49,2,FALSE))","v":""},{"$f":"IF(C122=\"\",\"\",VLOOKUP($C122,Lookup!$B$2:$E$49,3,FALSE))","v":""},null,null,null,"",null,"",null,"",null,"",null,null,"","0","","0","",true,0,"1","","0",2,null,"","0","","0","",true,"","0",0,"1",2,null,"  ","  "]
[null,null,null,{"$f":"IF(C123=\"\",\"\",VLOOKUP($C123,Lookup!$B$2:$E$49,2,FALSE))","v":""},{"$f":"IF(C123=\"\",\"\",VLOOKUP($C123,Lookup!$B$2:$E$49,3,FALSE))","v":""},null,null,null,"",null,"",null,"",null,"",null,null,"","0","","0","",true,0,"1","","0",2,null,"","0","","0","",true,"","0",0,"1",2,null,"  ","  "]
[null,null,null,{"$f":"IF(C124=\"\",\"\",VLOOKUP($C124,Lookup!$B$2:$E$49,2,FALSE))","v":""},{"$f":"IF(C124=\"\",\"\",VLOOKUP($C124,Lookup!$B$2:$E$49,3,FALSE))","v":""},null,null,null,"",null,"",null,"",null,"",null,null,"","0","","0","",true,0,"1","","0",2,null,"","0","","0","",true,"","0",0,"1",2,null,"  ","  "]
[null,null,null,{"$f":"IF(C125=\"\",\"\",VLOOKUP($C125,Lookup!$B$2:$E$49,2,FALSE))","v":""},{"$f":"IF(C125=\"\",\"\",VLOOKUP($C125,Lookup!$B$2:$E$49,3,FALSE))","v":""},null,null,null,"",null,"",null,"",null,"",null,null,"","0","","0","",true,0,"1","","0",2,null,"","0","","0","",true,"","0",0,"1",2,null,"  ","  "]
[null,null,null,{"$f":"IF(C126=\"\",\"\",VLOOKUP($C126,Lookup!$B$2:$E$49,2,FALSE))","v":""},{"$f":"IF(C126=\"\",\"\",VLOOKUP($C126,Lookup!$B$2:$E$49,3,FALSE))","v":""},null,null,null,"",null,"",null,"",null,"",null,null,"","0","","0","",true,0,"1","","0",2,null,"","0","","0","",true,"","0",0,"1",2,null,"  ","  "]
[null,null,null,{"$f":"IF(C127=\"\",\"\",VLOOKUP($C127,Lookup!$B$2:$E$49,2,FALSE))","v":""},{"$f":"IF(C127=\"\",\"\",VLOOKUP($C127,Lookup!$B$2:$E$49,3,FALSE))","v":""},null,null,null,"",null,"",null,"",null,"",null,null,"","0","","0","",true,0,"1","","0",2,null,"","0","","0","",true,"","0",0,"1",2,null,"  ","  "]
[null,null,null,{"$f":"IF(C128=\"\",\"\",VLOOKUP($C128,Lookup!$B$2:$E$49,2,FALSE))","v":""},{"$f":"IF(C128=\"\",\"\",VLOOKUP($C128,Lookup!$B$2:$E$49,3,FALSE))","v":""},null,null,null,"",null,"",null,"",null,"",null,null,"","0","","0","",true,0,"1","","0",2,null,"","0","","0","",true,"","0",0,"1",2,null,"  ","  "]
[null,null,null,{"$f":"IF(C129=\"\",\"\",VLOOKUP($C129,Lookup!$B$2:$E$49,2,FALSE))","v":""},{"$f":"IF(C129=\"\",\"\",VLOOKUP($C129,Lookup!$B$2:$E$49,3,FALSE))","v":""},null,null,null,"",null,"",null,"",null,"",null,null,"","0","","0","",true,0,"1","","0",2,null,"","0","","0","",true,"","0",0,"1",2,null,"  ","  "]
[null,null,null,{"$f":"IF(C130=\"\",\"\",VLOOKUP($C130,Lookup!$B$2:$E$49,2,FALSE))","v":""},{"$f":"IF(C130=\"\",\"\",VLOOKUP($C130,Lookup!$B$2:$E$49,3,FALSE))","v":""},null,null,null,"",null,"",null,"",null,"",null,null,"","0","","0","",true,0,"1","","0",2,null,"","0","","0","",true,"","0",0,"1",2,null,"  ","  "]
[null,null,null,{"$f":"IF(C131=\"\",\"\",VLOOKUP($C131,Lookup!$B$2:$E$49,2,FALSE))","v":""},{"$f":"IF(C131=\"\",\"\",VLOOKUP($C131,Lookup!$B$2:$E$49,3,FALSE))","v":""},null,null,null,"",null,"",null,"",null,"",null,null,"","0","","0","",true,0,"1","","0",2,null,"","0","","0","",true,"","0",0,"1",2,null,"  ","  "]
[null,null,null,{"$f":"IF(C132=\"\",\"\",VLOOKUP($C132,Lookup!$B$2:$E$49,2,FALSE))","v":""},{"$f":"IF(C132=\"\",\"\",VLOOKUP($C132,Lookup!$B$2:$E$49,3,FALSE))","v":""},null,null,null,"",null,"",null,"",null,"",null,null,"","0","","0","",true,0,"1","","0",2,null,"","0","","0","",true,"","0",0,"1",2,null,"  ","  "]
[null,null,null,{"$f":"IF(C133=\"\",\"\",VLOOKUP($C133,Lookup!$B$2:$E$49,2,FALSE))","v":""},{"$f":"IF(C133=\"\",\"\",VLOOKUP($C133,Lookup!$B$2:$E$49,3,FALSE))","v":""},null,null,null,"",null,"",null,"",null,"",null,null,"","0","","0","",true,0,"1","","0",2,null,"","0","","0","",true,"","0",0,"1",2,null,"  ","  "]
[null,null,null,{"$f":"IF(C134=\"\",\"\",VLOOKUP($C134,Lookup!$B$2:$E$49,2,FALSE))","v":""},{"$f":"IF(C134=\"\",\"\",VLOOKUP($C134,Lookup!$B$2:$E$49,3,FALSE))","v":""},null,null,null,{"$f":"IF(H134=\"\",\"\",IF(AB134+0>0,\"r\",IF(AB134+0=0,\"a\",\"\")))","v":""},null,{"$f":"IF(H134=\"\",\"\",IF(H134=J134,\"a\",\"r\"))","v":""},null,{"$f":"IF(L134=\"\",\"\",IF(AN134+0>0,\"r\",IF(AN134+0=0,\"a\",\"\")))","v":""},null,{"$f":"IF(L134=\"\",\"\",IF(L134=N134,\"a\",\"r\"))","v":""},null,null,{"$f":"IF(H134=\"\",\"\",LEFT(H134,2)+0)","v":""},{"$f":"IF(H134=\"\",\"0\",IF(AND(R134>=40,R134<=70),\"0\",\"1\"))","v":"0"},{"$f":"IF(H134=\"\",\"\",MID(H134,3,2)+0)","v":""},{"$f":"IF(H134=\"\",\"0\",IF(T134>59,\"1\",\"0\"))","v":"0"},{"$f":"IF(H134=\"\",\"\",MID(H134,5,5)+0)","v":""},{"$f":"IFERROR(V134>60,\"1\")","v":true},{"$f":"LEN(H134)","v":0},{"$f":"IF(X134<10,\"1\",\"0\")","v":"1"},{"$f":"RIGHT(H134,1)","v":""},{"$f":"IF(Z134=\"\",\"0\",IF(Z134=\"N\",\"0\",\"1\"))","v":"0"},{"$f":"S134+U134++Y134+W134+AA134","v":2},null,{"$f":"IF(L134=\"\",\"\",LEFT(L134,3)+0)","v":""},{"$f":"IF(L134=\"\",\"0\",IF(AD134>20,\"1\",\"0\"))","v":"0"},{"$f":"IF(L134=\"\",\"\",MID(L134,4,2)+0)","v":""},{"$f":"IF(L134=\"\",\"0\",IF(AF134>59,\"1\",\"0\"))","v":"0"},{"$f":"IF(L134=\"\",\"\",MID(L134,6,5)+0)","v":""},{"$f":"IFERROR(AH134>60,\"1\")","v":true},{"$f":"RIGHT(L134,1)","v":""},{"$f":"IF(L134=\"\",\"0\",IF(AJ134=\"W\",\"0\",IF(AJ134=\"E\",\"0\",\"1\")))","v":"0"},{"$f":"LEN(L134)","v":0},{"$f":"IF(AL134<11,\"1\",\"0\")","v":"1"},{"$f":"AE134+AG134+AI134+AK134+AM134","v":2},null,{"$f":"LEFT(H134,2)&\" \"& MID(H134,3,2)&\" \"&MID(H134,5,10)","v":"  "},{"$f":"LEFT(L134,3)&\" \"& MID(L134,4,2)&\" \"&MID(L134,6,10)","v":"  "}]
[null,null,null,{"$f":"IF(C135=\"\",\"\",VLOOKUP($C135,Lookup!$B$2:$E$49,2,FALSE))","v":""},{"$f":"IF(C135=\"\",\"\",VLOOKUP($C135,Lookup!$B$2:$E$49,3,FALSE))","v":""},null,null,null,"",null,"",null,"",null,"",null,null,"","0","","0","",true,0,"1","","0",2,null,"","0","","0","",true,"","0",0,"1",2,null,"  ","  "]
[null,null,null,{"$f":"IF(C136=\"\",\"\",VLOOKUP($C136,Lookup!$B$2:$E$49,2,FALSE))","v":""},{"$f":"IF(C136=\"\",\"\",VLOOKUP($C136,Lookup!$B$2:$E$49,3,FALSE))","v":""},null,null,null,"",null,"",null,"",null,"",null,null,"","0","","0","",true,0,"1","","0",2,null,"","0","","0","",true,"","0",0,"1",2,null,"  ","  "]
[null,null,null,{"$f":"IF(C137=\"\",\"\",VLOOKUP($C137,Lookup!$B$2:$E$49,2,FALSE))","v":""},{"$f":"IF(C137=\"\",\"\",VLOOKUP($C137,Lookup!$B$2:$E$49,3,FALSE))","v":""},null,null,null,"",null,"",null,"",null,"",null,null,"","0","","0","",true,0,"1","","0",2,null,"","0","","0","",true,"","0",0,"1",2,null,"  ","  "]
[null,null,null,{"$f":"IF(C138=\"\",\"\",VLOOKUP($C138,Lookup!$B$2:$E$49,2,FALSE))","v":""},{"$f":"IF(C138=\"\",\"\",VLOOKUP($C138,Lookup!$B$2:$E$49,3,FALSE))","v":""},null,null,null,"",null,"",null,"",null,"",null,null,"","0","","0","",true,0,"1","","0",2,null,"","0","","0","",true,"","0",0,"1",2,null,"  ","  "]
[null,null,null,{"$f":"IF(C139=\"\",\"\",VLOOKUP($C139,Lookup!$B$2:$E$49,2,FALSE))","v":""},{"$f":"IF(C139=\"\",\"\",VLOOKUP($C139,Lookup!$B$2:$E$49,3,FALSE))","v":""},null,null,null,"",null,"",null,"",null,"",null,null,"","0","","0","",true,0,"1","","0",2,null,"","0","","0","",true,"","0",0,"1",2,null,"  ","  "]
[null,null,null,{"$f":"IF(C140=\"\",\"\",VLOOKUP($C140,Lookup!$B$2:$E$49,2,FALSE))","v":""},{"$f":"IF(C140=\"\",\"\",VLOOKUP($C140,Lookup!$B$2:$E$49,3,FALSE))","v":""},null,null,null,"",null,"",null,"",null,"",null,null,"","0","","0","",true,0,"1","","0",2,null,"","0","","0","",true,"","0",0,"1",2,null,"  ","  "]
[null,null,null,{"$f":"IF(C141=\"\",\"\",VLOOKUP($C141,Lookup!$B$2:$E$49,2,FALSE))","v":""},{"$f":"IF(C141=\"\",\"\",VLOOKUP($C141,Lookup!$B$2:$E$49,3,FALSE))","v":""},null,null,null,"",null,"",null,"",null,"",null,null,"","0","","0","",true,0,"1","","0",2,null,"","0","","0","",true,"","0",0,"1",2,null,"  ","  "]
[null,null,null,{"$f":"IF(C142=\"\",\"\",VLOOKUP($C142,Lookup!$B$2:$E$49,2,FALSE))","v":""},{"$f":"IF(C142=\"\",\"\",VLOOKUP($C142,Lookup!$B$2:$E$49,3,FALSE))","v":""},null,null,null,"",null,"",null,"",null,"",null,null,"","0","","0","",true,0,"1","","0",2,null,"","0","","0","",true,"","0",0,"1",2,null,"  ","  "]
[null,null,null,{"$f":"IF(C143=\"\",\"\",VLOOKUP($C143,Lookup!$B$2:$E$49,2,FALSE))","v":""},{"$f":"IF(C143=\"\",\"\",VLOOKUP($C143,Lookup!$B$2:$E$49,3,FALSE))","v":""},null,null,null,"",null,"",null,"",null,"",null,null,"","0","","0","",true,0,"1","","0",2,null,"","0","","0","",true,"","0",0,"1",2,null,"  ","  "]
[null,null,null,{"$f":"IF(C144=\"\",\"\",VLOOKUP($C144,Lookup!$B$2:$E$49,2,FALSE))","v":""},{"$f":"IF(C144=\"\",\"\",VLOOKUP($C144,Lookup!$B$2:$E$49,3,FALSE))","v":""},null,null,null,"",null,"",null,"",null,"",null,null,"","0","","0","",true,0,"1","","0",2,null,"","0","","0","",true,"","0",0,"1",2,null,"  ","  "]
[null,null,null,{"$f":"IF(C145=\"\",\"\",VLOOKUP($C145,Lookup!$B$2:$E$49,2,FALSE))","v":""},{"$f":"IF(C145=\"\",\"\",VLOOKUP($C145,Lookup!$B$2:$E$49,3,FALSE))","v":""},null,null,null,"",null,"",null,"",null,"",null,null,"","0","","0","",true,0,"1","","0",2,null,"","0","","0","",true,"","0",0,"1",2,null,"  ","  "]
[null,null,null,{"$f":"IF(C146=\"\",\"\",VLOOKUP($C146,Lookup!$B$2:$E$49,2,FALSE))","v":""},{"$f":"IF(C146=\"\",\"\",VLOOKUP($C146,Lookup!$B$2:$E$49,3,FALSE))","v":""},null,null,null,"",null,"",null,"",null,"",null,null,"","0","","0","",true,0,"1","","0",2,null,"","0","","0","",true,"","0",0,"1",2,null,"  ","  "]
[null,null,null,{"$f":"IF(C147=\"\",\"\",VLOOKUP($C147,Lookup!$B$2:$E$49,2,FALSE))","v":""},{"$f":"IF(C147=\"\",\"\",VLOOKUP($C147,Lookup!$B$2:$E$49,3,FALSE))","v":""},null,null,null,"",null,"",null,"",null,"",null,null,"","0","","0","",true,0,"1","","0",2,null,"","0","","0","",true,"","0",0,"1",2,null,"  ","  "]
[null,null,null,{"$f":"IF(C148=\"\",\"\",VLOOKUP($C148,Lookup!$B$2:$E$49,2,FALSE))","v":""},{"$f":"IF(C148=\"\",\"\",VLOOKUP($C148,Lookup!$B$2:$E$49,3,FALSE))","v":""},null,null,null,"",null,"",null,"",null,"",null,null,"","0","","0","",true,0,"1","","0",2,null,"","0","","0","",true,"","0",0,"1",2,null,"  ","  "]
[null,null,null,{"$f":"IF(C149=\"\",\"\",VLOOKUP($C149,Lookup!$B$2:$E$49,2,FALSE))","v":""},{"$f":"IF(C149=\"\",\"\",VLOOKUP($C149,Lookup!$B$2:$E$49,3,FALSE))","v":""},null,null,null,"",null,"",null,"",null,"",null,null,"","0","","0","",true,0,"1","","0",2,null,"","0","","0","",true,"","0",0,"1",2,null,"  ","  "]
[null,null,null,{"$f":"IF(C150=\"\",\"\",VLOOKUP($C150,Lookup!$B$2:$E$49,2,FALSE))","v":""},{"$f":"IF(C150=\"\",\"\",VLOOKUP($C150,Lookup!$B$2:$E$49,3,FALSE))","v":""},null,null,null,"",null,"",null,"",null,"",null,null,"","0","","0","",true,0,"1","","0",2,null,"","0","","0","",true,"","0",0,"1",2,null,"  ","  "]
[null,null,null,{"$f":"IF(C151=\"\",\"\",VLOOKUP($C151,Lookup!$B$2:$E$49,2,FALSE))","v":""},{"$f":"IF(C151=\"\",\"\",VLOOKUP($C151,Lookup!$B$2:$E$49,3,FALSE))","v":""},null,null,null,"",null,"",null,"",null,"",null,null,"","0","","0","",true,0,"1","","0",2,null,"","0","","0","",true,"","0",0,"1",2,null,"  ","  "]
[null,null,null,{"$f":"IF(C152=\"\",\"\",VLOOKUP($C152,Lookup!$B$2:$E$49,2,FALSE))","v":""},{"$f":"IF(C152=\"\",\"\",VLOOKUP($C152,Lookup!$B$2:$E$49,3,FALSE))","v":""},null,null,null,"",null,"",null,"",null,"",null,null,"","0","","0","",true,0,"1","","0",2,null,"","0","","0","",true,"","0",0,"1",2,null,"  ","  "]
[null,null,null,{"$f":"IF(C153=\"\",\"\",VLOOKUP($C153,Lookup!$B$2:$E$49,2,FALSE))","v":""},{"$f":"IF(C153=\"\",\"\",VLOOKUP($C153,Lookup!$B$2:$E$49,3,FALSE))","v":""},null,null,null,"",null,"",null,"",null,"",null,null,"","0","","0","",true,0,"1","","0",2,null,"","0","","0","",true,"","0",0,"1",2,null,"  ","  "]
[null,null,null,{"$f":"IF(C154=\"\",\"\",VLOOKUP($C154,Lookup!$B$2:$E$49,2,FALSE))","v":""},{"$f":"IF(C154=\"\",\"\",VLOOKUP($C154,Lookup!$B$2:$E$49,3,FALSE))","v":""},null,null,null,"",null,"",null,"",null,"",null,null,"","0","","0","",true,0,"1","","0",2,null,"","0","","0","",true,"","0",0,"1",2,null,"  ","  "]
[null,null,null,{"$f":"IF(C155=\"\",\"\",VLOOKUP($C155,Lookup!$B$2:$E$49,2,FALSE))","v":""},{"$f":"IF(C155=\"\",\"\",VLOOKUP($C155,Lookup!$B$2:$E$49,3,FALSE))","v":""},null,null,null,"",null,"",null,"",null,"",null,null,"","0","","0","",true,0,"1","","0",2,null,"","0","","0","",true,"","0",0,"1",2,null,"  ","  "]
[null,null,null,{"$f":"IF(C156=\"\",\"\",VLOOKUP($C156,Lookup!$B$2:$E$49,2,FALSE))","v":""},{"$f":"IF(C156=\"\",\"\",VLOOKUP($C156,Lookup!$B$2:$E$49,3,FALSE))","v":""},null,null,null,"",null,"",null,"",null,"",null,null,"","0","","0","",true,0,"1","","0",2,null,"","0","","0","",true,"","0",0,"1",2,null,"  ","  "]
[null,null,null,{"$f":"IF(C157=\"\",\"\",VLOOKUP($C157,Lookup!$B$2:$E$49,2,FALSE))","v":""},{"$f":"IF(C157=\"\",\"\",VLOOKUP($C157,Lookup!$B$2:$E$49,3,FALSE))","v":""},null,null,null,"",null,"",null,"",null,"",null,null,"","0","","0","",true,0,"1","","0",2,null,"","0","","0","",true,"","0",0,"1",2,null,"  ","  "]
[null,null,null,{"$f":"IF(C158=\"\",\"\",VLOOKUP($C158,Lookup!$B$2:$E$49,2,FALSE))","v":""},{"$f":"IF(C158=\"\",\"\",VLOOKUP($C158,Lookup!$B$2:$E$49,3,FALSE))","v":""},null,null,null,"",null,"",null,"",null,"",null,null,"","0","","0","",true,0,"1","","0",2,null,"","0","","0","",true,"","0",0,"1",2,null,"  ","  "]
[null,null,null,{"$f":"IF(C159=\"\",\"\",VLOOKUP($C159,Lookup!$B$2:$E$49,2,FALSE))","v":""},{"$f":"IF(C159=\"\",\"\",VLOOKUP($C159,Lookup!$B$2:$E$49,3,FALSE))","v":""},null,null,null,"",null,"",null,"",null,"",null,null,"","0","","0","",true,0,"1","","0",2,null,"","0","","0","",true,"","0",0,"1",2,null,"  ","  "]
[null,null,null,{"$f":"IF(C160=\"\",\"\",VLOOKUP($C160,Lookup!$B$2:$E$49,2,FALSE))","v":""},{"$f":"IF(C160=\"\",\"\",VLOOKUP($C160,Lookup!$B$2:$E$49,3,FALSE))","v":""},null,null,null,"",null,"",null,"",null,"",null,null,"","0","","0","",true,0,"1","","0",2,null,"","0","","0","",true,"","0",0,"1",2,null,"  ","  "]
[null,null,null,{"$f":"IF(C161=\"\",\"\",VLOOKUP($C161,Lookup!$B$2:$E$49,2,FALSE))","v":""},{"$f":"IF(C161=\"\",\"\",VLOOKUP($C161,Lookup!$B$2:$E$49,3,FALSE))","v":""},null,null,null,"",null,"",null,"",null,"",null,null,"","0","","0","",true,0,"1","","0",2,null,"","0","","0","",true,"","0",0,"1",2,null,"  ","  "]
[null,null,null,{"$f":"IF(C162=\"\",\"\",VLOOKUP($C162,Lookup!$B$2:$E$49,2,FALSE))","v":""},{"$f":"IF(C162=\"\",\"\",VLOOKUP($C162,Lookup!$B$2:$E$49,3,FALSE))","v":""},null,null,null,"",null,"",null,"",null,"",null,null,"","0","","0","",true,0,"1","","0",2,null,"","0","","0","",true,"","0",0,"1",2,null,"  ","  "]
[null,null,null,{"$f":"IF(C163=\"\",\"\",VLOOKUP($C163,Lookup!$B$2:$E$49,2,FALSE))","v":""},{"$f":"IF(C163=\"\",\"\",VLOOKUP($C163,Lookup!$B$2:$E$49,3,FALSE))","v":""},null,null,null,"",null,"",null,"",null,"",null,null,"","0","","0","",true,0,"1","","0",2,null,"","0","","0","",true,"","0",0,"1",2,null,"  ","  "]
[null,null,null,{"$f":"IF(C164=\"\",\"\",VLOOKUP($C164,Lookup!$B$2:$E$49,2,FALSE))","v":""},{"$f":"IF(C164=\"\",\"\",VLOOKUP($C164,Lookup!$B$2:$E$49,3,FALSE))","v":""},null,null,null,"",null,"",null,"",null,"",null,null,"","0","","0","",true,0,"1","","0",2,null,"","0","","0","",true,"","0",0,"1",2,null,"  ","  "]
[null,null,null,{"$f":"IF(C165=\"\",\"\",VLOOKUP($C165,Lookup!$B$2:$E$49,2,FALSE))","v":""},{"$f":"IF(C165=\"\",\"\",VLOOKUP($C165,Lookup!$B$2:$E$49,3,FALSE))","v":""},null,null,null,"",null,"",null,"",null,"",null,null,"","0","","0","",true,0,"1","","0",2,null,"","0","","0","",true,"","0",0,"1",2,null,"  ","  "]
[null,null,null,{"$f":"IF(C166=\"\",\"\",VLOOKUP($C166,Lookup!$B$2:$E$49,2,FALSE))","v":""},{"$f":"IF(C166=\"\",\"\",VLOOKUP($C166,Lookup!$B$2:$E$49,3,FALSE))","v":""},null,null,null,"",null,"",null,"",null,"",null,null,"","0","","0","",true,0,"1","","0",2,null,"","0","","0","",true,"","0",0,"1",2,null,"  ","  "]
[null,null,null,{"$f":"IF(C167=\"\",\"\",VLOOKUP($C167,Lookup!$B$2:$E$49,2,FALSE))","v":""},{"$f":"IF(C167=\"\",\"\",VLOOKUP($C167,Lookup!$B$2:$E$49,3,FALSE))","v":""},null,null,null,"",null,"",null,"",null,"",null,null,"","0","","0","",true,0,"1","","0",2,null,"","0","","0","",true,"","0",0,"1",2,null,"  ","  "]
[null,null,null,{"$f":"IF(C168=\"\",\"\",VLOOKUP($C168,Lookup!$B$2:$E$49,2,FALSE))","v":""},{"$f":"IF(C168=\"\",\"\",VLOOKUP($C168,Lookup!$B$2:$E$49,3,FALSE))","v":""},null,null,null,"",null,"",null,"",null,"",null,null,"","0","","0","",true,0,"1","","0",2,null,"","0","","0","",true,"","0",0,"1",2,null,"  ","  "]
[null,null,null,{"$f":"IF(C169=\"\",\"\",VLOOKUP($C169,Lookup!$B$2:$E$49,2,FALSE))","v":""},{"$f":"IF(C169=\"\",\"\",VLOOKUP($C169,Lookup!$B$2:$E$49,3,FALSE))","v":""},null,null,null,"",null,"",null,"",null,"",null,null,"","0","","0","",true,0,"1","","0",2,null,"","0","","0","",true,"","0",0,"1",2,null,"  ","  "]
[null,null,null,{"$f":"IF(C170=\"\",\"\",VLOOKUP($C170,Lookup!$B$2:$E$49,2,FALSE))","v":""},{"$f":"IF(C170=\"\",\"\",VLOOKUP($C170,Lookup!$B$2:$E$49,3,FALSE))","v":""},null,null,null,"",null,"",null,"",null,"",null,null,"","0","","0","",true,0,"1","","0",2,null,"","0","","0","",true,"","0",0,"1",2,null,"  ","  "]
[null,null,null,{"$f":"IF(C171=\"\",\"\",VLOOKUP($C171,Lookup!$B$2:$E$49,2,FALSE))","v":""},{"$f":"IF(C171=\"\",\"\",VLOOKUP($C171,Lookup!$B$2:$E$49,3,FALSE))","v":""},null,null,null,"",null,"",null,"",null,"",null,null,"","0","","0","",true,0,"1","","0",2,null,"","0","","0","",true,"","0",0,"1",2,null,"  ","  "]
[null,null,null,{"$f":"IF(C172=\"\",\"\",VLOOKUP($C172,Lookup!$B$2:$E$49,2,FALSE))","v":""},{"$f":"IF(C172=\"\",\"\",VLOOKUP($C172,Lookup!$B$2:$E$49,3,FALSE))","v":""},null,null,null,"",null,"",null,"",null,"",null,null,"","0","","0","",true,0,"1","","0",2,null,"","0","","0","",true,"","0",0,"1",2,null,"  ","  "]
[null,null,null,{"$f":"IF(C173=\"\",\"\",VLOOKUP($C173,Lookup!$B$2:$E$49,2,FALSE))","v":""},{"$f":"IF(C173=\"\",\"\",VLOOKUP($C173,Lookup!$B$2:$E$49,3,FALSE))","v":""},null,null,null,"",null,"",null,"",null,"",null,null,"","0","","0","",true,0,"1","","0",2,null,"","0","","0","",true,"","0",0,"1",2,null,"  ","  "]
[null,null,null,{"$f":"IF(C174=\"\",\"\",VLOOKUP($C174,Lookup!$B$2:$E$49,2,FALSE))","v":""},{"$f":"IF(C174=\"\",\"\",VLOOKUP($C174,Lookup!$B$2:$E$49,3,FALSE))","v":""},null,null,null,"",null,"",null,"",null,"",null,null,"","0","","0","",true,0,"1","","0",2,null,"","0","","0","",true,"","0",0,"1",2,null,"  ","  "]
[null,null,null,{"$f":"IF(C175=\"\",\"\",VLOOKUP($C175,Lookup!$B$2:$E$49,2,FALSE))","v":""},{"$f":"IF(C175=\"\",\"\",VLOOKUP($C175,Lookup!$B$2:$E$49,3,FALSE))","v":""},null,null,null,"",null,"",null,"",null,"",null,null,"","0","","0","",true,0,"1","","0",2,null,"","0","","0","",true,"","0",0,"1",2,null,"  ","  "]
[null,null,null,{"$f":"IF(C176=\"\",\"\",VLOOKUP($C176,Lookup!$B$2:$E$49,2,FALSE))","v":""},{"$f":"IF(C176=\"\",\"\",VLOOKUP($C176,Lookup!$B$2:$E$49,3,FALSE))","v":""},null,null,null,"",null,"",null,"",null,"",null,null,"","0","","0","",true,0,"1","","0",2,null,"","0","","0","",true,"","0",0,"1",2,null,"  ","  "]
[null,null,null,{"$f":"IF(C177=\"\",\"\",VLOOKUP($C177,Lookup!$B$2:$E$49,2,FALSE))","v":""},{"$f":"IF(C177=\"\",\"\",VLOOKUP($C177,Lookup!$B$2:$E$49,3,FALSE))","v":""},null,null,null,"",null,"",null,"",null,"",null,null,"","0","","0","",true,0,"1","","0",2,null,"","0","","0","",true,"","0",0,"1",2,null,"  ","  "]
[null,null,null,{"$f":"IF(C178=\"\",\"\",VLOOKUP($C178,Lookup!$B$2:$E$49,2,FALSE))","v":""},{"$f":"IF(C178=\"\",\"\",VLOOKUP($C178,Lookup!$B$2:$E$49,3,FALSE))","v":""},null,null,null,"",null,"",null,"",null,"",null,null,"","0","","0","",true,0,"1","","0",2,null,"","0","","0","",true,"","0",0,"1",2,null,"  ","  "]
[null,null,null,{"$f":"IF(C179=\"\",\"\",VLOOKUP($C179,Lookup!$B$2:$E$49,2,FALSE))","v":""},{"$f":"IF(C179=\"\",\"\",VLOOKUP($C179,Lookup!$B$2:$E$49,3,FALSE))","v":""},null,null,null,"",null,"",null,"",null,"",null,null,"","0","","0","",true,0,"1","","0",2,null,"","0","","0","",true,"","0",0,"1",2,null,"  ","  "]
[null,null,null,{"$f":"IF(C180=\"\",\"\",VLOOKUP($C180,Lookup!$B$2:$E$49,2,FALSE))","v":""},{"$f":"IF(C180=\"\",\"\",VLOOKUP($C180,Lookup!$B$2:$E$49,3,FALSE))","v":""},null,null,null,"",null,"",null,"",null,"",null,null,"","0","","0","",true,0,"1","","0",2,null,"","0","","0","",true,"","0",0,"1",2,null,"  ","  "]
[null,null,null,{"$f":"IF(C181=\"\",\"\",VLOOKUP($C181,Lookup!$B$2:$E$49,2,FALSE))","v":""},{"$f":"IF(C181=\"\",\"\",VLOOKUP($C181,Lookup!$B$2:$E$49,3,FALSE))","v":""},null,null,null,"",null,"",null,"",null,"",null,null,"","0","","0","",true,0,"1","","0",2,null,"","0","","0","",true,"","0",0,"1",2,null,"  ","  "]
[null,null,null,{"$f":"IF(C182=\"\",\"\",VLOOKUP($C182,Lookup!$B$2:$E$49,2,FALSE))","v":""},{"$f":"IF(C182=\"\",\"\",VLOOKUP($C182,Lookup!$B$2:$E$49,3,FALSE))","v":""},null,null,null,"",null,"",null,"",null,"",null,null,"","0","","0","",true,0,"1","","0",2,null,"","0","","0","",true,"","0",0,"1",2,null,"  ","  "]
[null,null,null,{"$f":"IF(C183=\"\",\"\",VLOOKUP($C183,Lookup!$B$2:$E$49,2,FALSE))","v":""},{"$f":"IF(C183=\"\",\"\",VLOOKUP($C183,Lookup!$B$2:$E$49,3,FALSE))","v":""},null,null,null,"",null,"",null,"",null,"",null,null,"","0","","0","",true,0,"1","","0",2,null,"","0","","0","",true,"","0",0,"1",2,null,"  ","  "]
[null,null,null,{"$f":"IF(C184=\"\",\"\",VLOOKUP($C184,Lookup!$B$2:$E$49,2,FALSE))","v":""},{"$f":"IF(C184=\"\",\"\",VLOOKUP($C184,Lookup!$B$2:$E$49,3,FALSE))","v":""},null,null,null,"",null,"",null,"",null,"",null,null,"","0","","0","",true,0,"1","","0",2,null,"","0","","0","",true,"","0",0,"1",2,null,"  ","  "]
[null,null,null,{"$f":"IF(C185=\"\",\"\",VLOOKUP($C185,Lookup!$B$2:$E$49,2,FALSE))","v":""},{"$f":"IF(C185=\"\",\"\",VLOOKUP($C185,Lookup!$B$2:$E$49,3,FALSE))","v":""},null,null,null,"",null,"",null,"",null,"",null,null,"","0","","0","",true,0,"1","","0",2,null,"","0","","0","",true,"","0",0,"1",2,null,"  ","  "]
[null,null,null,{"$f":"IF(C186=\"\",\"\",VLOOKUP($C186,Lookup!$B$2:$E$49,2,FALSE))","v":""},{"$f":"IF(C186=\"\",\"\",VLOOKUP($C186,Lookup!$B$2:$E$49,3,FALSE))","v":""},null,null,null,"",null,"",null,"",null,"",null,null,"","0","","0","",true,0,"1","","0",2,null,"","0","","0","",true,"","0",0,"1",2,null,"  ","  "]
[null,null,null,{"$f":"IF(C187=\"\",\"\",VLOOKUP($C187,Lookup!$B$2:$E$49,2,FALSE))","v":""},{"$f":"IF(C187=\"\",\"\",VLOOKUP($C187,Lookup!$B$2:$E$49,3,FALSE))","v":""},null,null,null,"",null,"",null,"",null,"",null,null,"","0","","0","",true,0,"1","","0",2,null,"","0","","0","",true,"","0",0,"1",2,null,"  ","  "]
[null,null,null,{"$f":"IF(C188=\"\",\"\",VLOOKUP($C188,Lookup!$B$2:$E$49,2,FALSE))","v":""},{"$f":"IF(C188=\"\",\"\",VLOOKUP($C188,Lookup!$B$2:$E$49,3,FALSE))","v":""},null,null,null,"",null,"",null,"",null,"",null,null,"","0","","0","",true,0,"1","","0",2,null,"","0","","0","",true,"","0",0,"1",2,null,"  ","  "]
[null,null,null,{"$f":"IF(C189=\"\",\"\",VLOOKUP($C189,Lookup!$B$2:$E$49,2,FALSE))","v":""},{"$f":"IF(C189=\"\",\"\",VLOOKUP($C189,Lookup!$B$2:$E$49,3,FALSE))","v":""},null,null,null,"",null,"",null,"",null,"",null,null,"","0","","0","",true,0,"1","","0",2,null,"","0","","0","",true,"","0",0,"1",2,null,"  ","  "]
[null,null,null,{"$f":"IF(C190=\"\",\"\",VLOOKUP($C190,Lookup!$B$2:$E$49,2,FALSE))","v":""},{"$f":"IF(C190=\"\",\"\",VLOOKUP($C190,Lookup!$B$2:$E$49,3,FALSE))","v":""},null,null,null,"",null,"",null,"",null,"",null,null,"","0","","0","",true,0,"1","","0",2,null,"","0","","0","",true,"","0",0,"1",2,null,"  ","  "]
[null,null,null,{"$f":"IF(C191=\"\",\"\",VLOOKUP($C191,Lookup!$B$2:$E$49,2,FALSE))","v":""},{"$f":"IF(C191=\"\",\"\",VLOOKUP($C191,Lookup!$B$2:$E$49,3,FALSE))","v":""},null,null,null,"",null,"",null,"",null,"",null,null,"","0","","0","",true,0,"1","","0",2,null,"","0","","0","",true,"","0",0,"1",2,null,"  ","  "]
[null,null,null,{"$f":"IF(C192=\"\",\"\",VLOOKUP($C192,Lookup!$B$2:$E$49,2,FALSE))","v":""},{"$f":"IF(C192=\"\",\"\",VLOOKUP($C192,Lookup!$B$2:$E$49,3,FALSE))","v":""},null,null,null,"",null,"",null,"",null,"",null,null,"","0","","0","",true,0,"1","","0",2,null,"","0","","0","",true,"","0",0,"1",2,null,"  ","  "]
[null,null,null,{"$f":"IF(C193=\"\",\"\",VLOOKUP($C193,Lookup!$B$2:$E$49,2,FALSE))","v":""},{"$f":"IF(C193=\"\",\"\",VLOOKUP($C193,Lookup!$B$2:$E$49,3,FALSE))","v":""},null,null,null,"",null,"",null,"",null,"",null,null,"","0","","0","",true,0,"1","","0",2,null,"","0","","0","",true,"","0",0,"1",2,null,"  ","  "]
[null,null,null,{"$f":"IF(C194=\"\",\"\",VLOOKUP($C194,Lookup!$B$2:$E$49,2,FALSE))","v":""},{"$f":"IF(C194=\"\",\"\",VLOOKUP($C194,Lookup!$B$2:$E$49,3,FALSE))","v":""},null,null,null,"",null,"",null,"",null,"",null,null,"","0","","0","",true,0,"1","","0",2,null,"","0","","0","",true,"","0",0,"1",2,null,"  ","  "]
[null,null,null,{"$f":"IF(C195=\"\",\"\",VLOOKUP($C195,Lookup!$B$2:$E$49,2,FALSE))","v":""},{"$f":"IF(C195=\"\",\"\",VLOOKUP($C195,Lookup!$B$2:$E$49,3,FALSE))","v":""},null,null,null,"",null,"",null,"",null,"",null,null,"","0","","0","",true,0,"1","","0",2,null,"","0","","0","",true,"","0",0,"1",2,null,"  ","  "]
[null,null,null,{"$f":"IF(C196=\"\",\"\",VLOOKUP($C196,Lookup!$B$2:$E$49,2,FALSE))","v":""},{"$f":"IF(C196=\"\",\"\",VLOOKUP($C196,Lookup!$B$2:$E$49,3,FALSE))","v":""},null,null,null,"",null,"",null,"",null,"",null,null,"","0","","0","",true,0,"1","","0",2,null,"","0","","0","",true,"","0",0,"1",2,null,"  ","  "]
[null,null,null,{"$f":"IF(C197=\"\",\"\",VLOOKUP($C197,Lookup!$B$2:$E$49,2,FALSE))","v":""},{"$f":"IF(C197=\"\",\"\",VLOOKUP($C197,Lookup!$B$2:$E$49,3,FALSE))","v":""},null,null,null,"",null,"",null,"",null,"",null,null,"","0","","0","",true,0,"1","","0",2,null,"","0","","0","",true,"","0",0,"1",2,null,"  ","  "]
[null,null,null,{"$f":"IF(C198=\"\",\"\",VLOOKUP($C198,Lookup!$B$2:$E$49,2,FALSE))","v":""},{"$f":"IF(C198=\"\",\"\",VLOOKUP($C198,Lookup!$B$2:$E$49,3,FALSE))","v":""},null,null,null,{"$f":"IF(H198=\"\",\"\",IF(AB198+0>0,\"r\",IF(AB198+0=0,\"a\",\"\")))","v":""},null,{"$f":"IF(H198=\"\",\"\",IF(H198=J198,\"a\",\"r\"))","v":""},null,{"$f":"IF(L198=\"\",\"\",IF(AN198+0>0,\"r\",IF(AN198+0=0,\"a\",\"\")))","v":""},null,{"$f":"IF(L198=\"\",\"\",IF(L198=N198,\"a\",\"r\"))","v":""},null,null,{"$f":"IF(H198=\"\",\"\",LEFT(H198,2)+0)","v":""},{"$f":"IF(H198=\"\",\"0\",IF(AND(R198>=40,R198<=70),\"0\",\"1\"))","v":"0"},{"$f":"IF(H198=\"\",\"\",MID(H198,3,2)+0)","v":""},{"$f":"IF(H198=\"\",\"0\",IF(T198>59,\"1\",\"0\"))","v":"0"},{"$f":"IF(H198=\"\",\"\",MID(H198,5,5)+0)","v":""},{"$f":"IFERROR(V198>60,\"1\")","v":true},{"$f":"LEN(H198)","v":0},{"$f":"IF(X198<10,\"1\",\"0\")","v":"1"},{"$f":"RIGHT(H198,1)","v":""},{"$f":"IF(Z198=\"\",\"0\",IF(Z198=\"N\",\"0\",\"1\"))","v":"0"},{"$f":"S198+U198++Y198+W198+AA198","v":2},null,{"$f":"IF(L198=\"\",\"\",LEFT(L198,3)+0)","v":""},{"$f":"IF(L198=\"\",\"0\",IF(AD198>20,\"1\",\"0\"))","v":"0"},{"$f":"IF(L198=\"\",\"\",MID(L198,4,2)+0)","v":""},{"$f":"IF(L198=\"\",\"0\",IF(AF198>59,\"1\",\"0\"))","v":"0"},{"$f":"IF(L198=\"\",\"\",MID(L198,6,5)+0)","v":""},{"$f":"IFERROR(AH198>60,\"1\")","v":true},{"$f":"RIGHT(L198,1)","v":""},{"$f":"IF(L198=\"\",\"0\",IF(AJ198=\"W\",\"0\",IF(AJ198=\"E\",\"0\",\"1\")))","v":"0"},{"$f":"LEN(L198)","v":0},{"$f":"IF(AL198<11,\"1\",\"0\")","v":"1"},{"$f":"AE198+AG198+AI198+AK198+AM198","v":2},null,{"$f":"LEFT(H198,2)&\" \"& MID(H198,3,2)&\" \"&MID(H198,5,10)","v":"  "},{"$f":"LEFT(L198,3)&\" \"& MID(L198,4,2)&\" \"&MID(L198,6,10)","v":"  "}]
[null,null,null,{"$f":"IF(C199=\"\",\"\",VLOOKUP($C199,Lookup!$B$2:$E$49,2,FALSE))","v":""},{"$f":"IF(C199=\"\",\"\",VLOOKUP($C199,Lookup!$B$2:$E$49,3,FALSE))","v":""},null,null,null,"",null,"",null,"",null,"",null,null,"","0","","0","",true,0,"1","","0",2,null,"","0","","0","",true,"","0",0,"1",2,null,"  ","  "]
[null,null,null,{"$f":"IF(C200=\"\",\"\",VLOOKUP($C200,Lookup!$B$2:$E$49,2,FALSE))","v":""},{"$f":"IF(C200=\"\",\"\",VLOOKUP($C200,Lookup!$B$2:$E$49,3,FALSE))","v":""},null,null,null,"",null,"",null,"",null,"",null,null,"","0","","0","",true,0,"1","","0",2,null,"","0","","0","",true,"","0",0,"1",2,null,"  ","  "]
[null,null,null,{"$f":"IF(C201=\"\",\"\",VLOOKUP($C201,Lookup!$B$2:$E$49,2,FALSE))","v":""},{"$f":"IF(C201=\"\",\"\",VLOOKUP($C201,Lookup!$B$2:$E$49,3,FALSE))","v":""},null,null,null,"",null,"",null,"",null,"",null,null,"","0","","0","",true,0,"1","","0",2,null,"","0","","0","",true,"","0",0,"1",2,null,"  ","  "]
[null,null,null,{"$f":"IF(C202=\"\",\"\",VLOOKUP($C202,Lookup!$B$2:$E$49,2,FALSE))","v":""},{"$f":"IF(C202=\"\",\"\",VLOOKUP($C202,Lookup!$B$2:$E$49,3,FALSE))","v":""},null,null,null,"",null,"",null,"",null,"",null,null,"","0","","0","",true,0,"1","","0",2,null,"","0","","0","",true,"","0",0,"1",2,null,"  ","  "]
[null,null,null,{"$f":"IF(C203=\"\",\"\",VLOOKUP($C203,Lookup!$B$2:$E$49,2,FALSE))","v":""},{"$f":"IF(C203=\"\",\"\",VLOOKUP($C203,Lookup!$B$2:$E$49,3,FALSE))","v":""},null,null,null,"",null,"",null,"",null,"",null,null,"","0","","0","",true,0,"1","","0",2,null,"","0","","0","",true,"","0",0,"1",2,null,"  ","  "]
[null,null,null,{"$f":"IF(C204=\"\",\"\",VLOOKUP($C204,Lookup!$B$2:$E$49,2,FALSE))","v":""},{"$f":"IF(C204=\"\",\"\",VLOOKUP($C204,Lookup!$B$2:$E$49,3,FALSE))","v":""},null,null,null,"",null,"",null,"",null,"",null,null,"","0","","0","",true,0,"1","","0",2,null,"","0","","0","",true,"","0",0,"1",2,null,"  ","  "]
[null,null,null,{"$f":"IF(C205=\"\",\"\",VLOOKUP($C205,Lookup!$B$2:$E$49,2,FALSE))","v":""},{"$f":"IF(C205=\"\",\"\",VLOOKUP($C205,Lookup!$B$2:$E$49,3,FALSE))","v":""},null,null,null,null,null,null,null,null,null,null,{"$f":"COUNTIF(P5:P204,\"Yes\")","v":0}]

{"sheet":"ENR 2 Temp","index":5,"n_rows":58,"n_cols":12,"rows_kept":58,"cut":false,"hidden":true,"merged":[[4,1,5,1],[4,10,5,10],[4,11,5,11],[6,2,6,3],[7,6,54,6],[7,7,54,7],[7,8,54,8],[7,9,54,9],[1,3,1,4],[1,6,1,8],[1,9,1,11],[2,1,2,2],[2,3,2,4],[2,6,2,8],[2,9,2,11]]}
[]
[null,"1a. ENR Section:",null,"1b. Name of Airspace:",null,null,{"$f":"\"2a. Partial or complete description of \"&D3&\":\"","v":"2a. Partial or complete description of :"},null,null,{"$f":"IF(G3=\"Partial\",\"2b. Describe parts of \"&D3&\" not included in this entry (therefore assumed unchanged):\",\"2b. N/A\")","v":"2b. N/A"}]
[]
[]
[null,"\n\n\n\n\n",{"$f":"IF(B3=\"\",\"\",B3)","v":""},null,null,null,null,null,null,null,{"$f":"\"A total of \"&COUNTIF(K8:K56,\"Yes\")","v":"A total of 0"}]
[null,null,"Only one named airspace per worksheet - additional sheets are added via the Content and Approval tab. "]
[null,"Select points below in publication order (Origin North/West & Clockwise)",{"$f":"\"Name\nLateral Lmits\nVertical Limits\nClass of Airspace\n\"&D3","v":"Name\nLateral Lmits\nVertical Limits\nClass of Airspace\n"},null,"Optional 1.\nTextual description to describe join type. Great circle line assumed if blank","Optional 2. Radius of arc","Unit Providing Service","Callsign\nLanguage\nHours of Service\nConditions of Use","Frequency MHz/\nChannel Purpose/\nSATVOICE\nnumber","Remarks","CAA\nissues to resolve?","Additional CAA Comments"]
[null,null,{"$f":"IF(B8=\"\",\"\",IFERROR(VLOOKUP($B8,'Latitude & Longitude'!$B$5:$L$1001,7,FALSE),\"No Change\"))","v":""},{"$f":"IF(B8=\"\",\"\",IFERROR(VLOOKUP($B8,'Latitude & Longitude'!$B$5:$L$1001,11,FALSE),\"No Change\"))","v":""}]
[null,null,{"$f":"IF(B9=\"\",\"\",IFERROR(VLOOKUP($B9,'Latitude & Longitude'!$B$5:$L$1001,7,FALSE),\"No Change\"))","v":""},{"$f":"IF(B9=\"\",\"\",IFERROR(VLOOKUP($B9,'Latitude & Longitude'!$B$5:$L$1001,11,FALSE),\"No Change\"))","v":""}]
[null,null,{"$f":"IF(B10=\"\",\"\",IFERROR(VLOOKUP($B10,'Latitude & Longitude'!$B$5:$L$1001,7,FALSE),\"No Change\"))","v":""},{"$f":"IF(B10=\"\",\"\",IFERROR(VLOOKUP($B10,'Latitude & Longitude'!$B$5:$L$1001,11,FALSE),\"No Change\"))","v":""}]
[null,null,{"$f":"IF(B11=\"\",\"\",IFERROR(VLOOKUP($B11,'Latitude & Longitude'!$B$5:$L$1001,7,FALSE),\"No Change\"))","v":""},{"$f":"IF(B11=\"\",\"\",IFERROR(VLOOKUP($B11,'Latitude & Longitude'!$B$5:$L$1001,11,FALSE),\"No Change\"))","v":""}]
[null,null,{"$f":"IF(B12=\"\",\"\",IFERROR(VLOOKUP($B12,'Latitude & Longitude'!$B$5:$L$1001,7,FALSE),\"No Change\"))","v":""},{"$f":"IF(B12=\"\",\"\",IFERROR(VLOOKUP($B12,'Latitude & Longitude'!$B$5:$L$1001,11,FALSE),\"No Change\"))","v":""}]
[null,null,{"$f":"IF(B13=\"\",\"\",IFERROR(VLOOKUP($B13,'Latitude & Longitude'!$B$5:$L$1001,7,FALSE),\"No Change\"))","v":""},{"$f":"IF(B13=\"\",\"\",IFERROR(VLOOKUP($B13,'Latitude & Longitude'!$B$5:$L$1001,11,FALSE),\"No Change\"))","v":""}]
[null,null,{"$f":"IF(B14=\"\",\"\",IFERROR(VLOOKUP($B14,'Latitude & Longitude'!$B$5:$L$1001,7,FALSE),\"No Change\"))","v":""},{"$f":"IF(B14=\"\",\"\",IFERROR(VLOOKUP($B14,'Latitude & Longitude'!$B$5:$L$1001,11,FALSE),\"No Change\"))","v":""}]
[null,null,{"$f":"IF(B15=\"\",\"\",IFERROR(VLOOKUP($B15,'Latitude & Longitude'!$B$5:$L$1001,7,FALSE),\"No Change\"))","v":""},{"$f":"IF(B15=\"\",\"\",IFERROR(VLOOKUP($B15,'Latitude & Longitude'!$B$5:$L$1001,11,FALSE),\"No Change\"))","v":""}]
[null,null,{"$f":"IF(B16=\"\",\"\",IFERROR(VLOOKUP($B16,'Latitude & Longitude'!$B$5:$L$1001,7,FALSE),\"No Change\"))","v":""},{"$f":"IF(B16=\"\",\"\",IFERROR(VLOOKUP($B16,'Latitude & Longitude'!$B$5:$L$1001,11,FALSE),\"No Change\"))","v":""}]
[null,null,{"$f":"IF(B17=\"\",\"\",IFERROR(VLOOKUP($B17,'Latitude & Longitude'!$B$5:$L$1001,7,FALSE),\"No Change\"))","v":""},{"$f":"IF(B17=\"\",\"\",IFERROR(VLOOKUP($B17,'Latitude & Longitude'!$B$5:$L$1001,11,FALSE),\"No Change\"))","v":""}]
[null,null,{"$f":"IF(B18=\"\",\"\",IFERROR(VLOOKUP($B18,'Latitude & Longitude'!$B$5:$L$1001,7,FALSE),\"No Change\"))","v":""},{"$f":"IF(B18=\"\",\"\",IFERROR(VLOOKUP($B18,'Latitude & Longitude'!$B$5:$L$1001,11,FALSE),\"No Change\"))","v":""}]
[null,null,{"$f":"IF(B19=\"\",\"\",IFERROR(VLOOKUP($B19,'Latitude & Longitude'!$B$5:$L$1001,7,FALSE),\"No Change\"))","v":""},{"$f":"IF(B19=\"\",\"\",IFERROR(VLOOKUP($B19,'Latitude & Longitude'!$B$5:$L$1001,11,FALSE),\"No Change\"))","v":""}]
[null,null,{"$f":"IF(B20=\"\",\"\",IFERROR(VLOOKUP($B20,'Latitude & Longitude'!$B$5:$L$1001,7,FALSE),\"No Change\"))","v":""},{"$f":"IF(B20=\"\",\"\",IFERROR(VLOOKUP($B20,'Latitude & Longitude'!$B$5:$L$1001,11,FALSE),\"No Change\"))","v":""}]
[null,null,{"$f":"IF(B21=\"\",\"\",IFERROR(VLOOKUP($B21,'Latitude & Longitude'!$B$5:$L$1001,7,FALSE),\"No Change\"))","v":""},{"$f":"IF(B21=\"\",\"\",IFERROR(VLOOKUP($B21,'Latitude & Longitude'!$B$5:$L$1001,11,FALSE),\"No Change\"))","v":""}]
[null,null,{"$f":"IF(B22=\"\",\"\",IFERROR(VLOOKUP($B22,'Latitude & Longitude'!$B$5:$L$1001,7,FALSE),\"No Change\"))","v":""},{"$f":"IF(B22=\"\",\"\",IFERROR(VLOOKUP($B22,'Latitude & Longitude'!$B$5:$L$1001,11,FALSE),\"No Change\"))","v":""}]
[null,null,{"$f":"IF(B23=\"\",\"\",IFERROR(VLOOKUP($B23,'Latitude & Longitude'!$B$5:$L$1001,7,FALSE),\"No Change\"))","v":""},{"$f":"IF(B23=\"\",\"\",IFERROR(VLOOKUP($B23,'Latitude & Longitude'!$B$5:$L$1001,11,FALSE),\"No Change\"))","v":""}]
[null,null,{"$f":"IF(B24=\"\",\"\",IFERROR(VLOOKUP($B24,'Latitude & Longitude'!$B$5:$L$1001,7,FALSE),\"No Change\"))","v":""},{"$f":"IF(B24=\"\",\"\",IFERROR(VLOOKUP($B24,'Latitude & Longitude'!$B$5:$L$1001,11,FALSE),\"No Change\"))","v":""}]
[null,null,{"$f":"IF(B25=\"\",\"\",IFERROR(VLOOKUP($B25,'Latitude & Longitude'!$B$5:$L$1001,7,FALSE),\"No Change\"))","v":""},{"$f":"IF(B25=\"\",\"\",IFERROR(VLOOKUP($B25,'Latitude & Longitude'!$B$5:$L$1001,11,FALSE),\"No Change\"))","v":""}]
[null,null,{"$f":"IF(B26=\"\",\"\",IFERROR(VLOOKUP($B26,'Latitude & Longitude'!$B$5:$L$1001,7,FALSE),\"No Change\"))","v":""},{"$f":"IF(B26=\"\",\"\",IFERROR(VLOOKUP($B26,'Latitude & Longitude'!$B$5:$L$1001,11,FALSE),\"No Change\"))","v":""}]
[null,null,{"$f":"IF(B27=\"\",\"\",IFERROR(VLOOKUP($B27,'Latitude & Longitude'!$B$5:$L$1001,7,FALSE),\"No Change\"))","v":""},{"$f":"IF(B27=\"\",\"\",IFERROR(VLOOKUP($B27,'Latitude & Longitude'!$B$5:$L$1001,11,FALSE),\"No Change\"))","v":""}]
[null,null,{"$f":"IF(B28=\"\",\"\",IFERROR(VLOOKUP($B28,'Latitude & Longitude'!$B$5:$L$1001,7,FALSE),\"No Change\"))","v":""},{"$f":"IF(B28=\"\",\"\",IFERROR(VLOOKUP($B28,'Latitude & Longitude'!$B$5:$L$1001,11,FALSE),\"No Change\"))","v":""}]
[null,null,{"$f":"IF(B29=\"\",\"\",IFERROR(VLOOKUP($B29,'Latitude & Longitude'!$B$5:$L$1001,7,FALSE),\"No Change\"))","v":""},{"$f":"IF(B29=\"\",\"\",IFERROR(VLOOKUP($B29,'Latitude & Longitude'!$B$5:$L$1001,11,FALSE),\"No Change\"))","v":""}]
[null,null,{"$f":"IF(B30=\"\",\"\",IFERROR(VLOOKUP($B30,'Latitude & Longitude'!$B$5:$L$1001,7,FALSE),\"No Change\"))","v":""},{"$f":"IF(B30=\"\",\"\",IFERROR(VLOOKUP($B30,'Latitude & Longitude'!$B$5:$L$1001,11,FALSE),\"No Change\"))","v":""}]
[null,null,{"$f":"IF(B31=\"\",\"\",IFERROR(VLOOKUP($B31,'Latitude & Longitude'!$B$5:$L$1001,7,FALSE),\"No Change\"))","v":""},{"$f":"IF(B31=\"\",\"\",IFERROR(VLOOKUP($B31,'Latitude & Longitude'!$B$5:$L$1001,11,FALSE),\"No Change\"))","v":""}]
[null,null,{"$f":"IF(B32=\"\",\"\",IFERROR(VLOOKUP($B32,'Latitude & Longitude'!$B$5:$L$1001,7,FALSE),\"No Change\"))","v":""},{"$f":"IF(B32=\"\",\"\",IFERROR(VLOOKUP($B32,'Latitude & Longitude'!$B$5:$L$1001,11,FALSE),\"No Change\"))","v":""}]
[null,null,{"$f":"IF(B33=\"\",\"\",IFERROR(VLOOKUP($B33,'Latitude & Longitude'!$B$5:$L$1001,7,FALSE),\"No Change\"))","v":""},{"$f":"IF(B33=\"\",\"\",IFERROR(VLOOKUP($B33,'Latitude & Longitude'!$B$5:$L$1001,11,FALSE),\"No Change\"))","v":""}]
[null,null,{"$f":"IF(B34=\"\",\"\",IFERROR(VLOOKUP($B34,'Latitude & Longitude'!$B$5:$L$1001,7,FALSE),\"No Change\"))","v":""},{"$f":"IF(B34=\"\",\"\",IFERROR(VLOOKUP($B34,'Latitude & Longitude'!$B$5:$L$1001,11,FALSE),\"No Change\"))","v":""}]
[null,null,{"$f":"IF(B35=\"\",\"\",IFERROR(VLOOKUP($B35,'Latitude & Longitude'!$B$5:$L$1001,7,FALSE),\"No Change\"))","v":""},{"$f":"IF(B35=\"\",\"\",IFERROR(VLOOKUP($B35,'Latitude & Longitude'!$B$5:$L$1001,11,FALSE),\"No Change\"))","v":""}]
[null,null,{"$f":"IF(B36=\"\",\"\",IFERROR(VLOOKUP($B36,'Latitude & Longitude'!$B$5:$L$1001,7,FALSE),\"No Change\"))","v":""},{"$f":"IF(B36=\"\",\"\",IFERROR(VLOOKUP($B36,'Latitude & Longitude'!$B$5:$L$1001,11,FALSE),\"No Change\"))","v":""}]
[null,null,{"$f":"IF(B37=\"\",\"\",IFERROR(VLOOKUP($B37,'Latitude & Longitude'!$B$5:$L$1001,7,FALSE),\"No Change\"))","v":""},{"$f":"IF(B37=\"\",\"\",IFERROR(VLOOKUP($B37,'Latitude & Longitude'!$B$5:$L$1001,11,FALSE),\"No Change\"))","v":""}]
[null,null,{"$f":"IF(B38=\"\",\"\",IFERROR(VLOOKUP($B38,'Latitude & Longitude'!$B$5:$L$1001,7,FALSE),\"No Change\"))","v":""},{"$f":"IF(B38=\"\",\"\",IFERROR(VLOOKUP($B38,'Latitude & Longitude'!$B$5:$L$1001,11,FALSE),\"No Change\"))","v":""}]
[null,null,{"$f":"IF(B39=\"\",\"\",IFERROR(VLOOKUP($B39,'Latitude & Longitude'!$B$5:$L$1001,7,FALSE),\"No Change\"))","v":""},{"$f":"IF(B39=\"\",\"\",IFERROR(VLOOKUP($B39,'Latitude & Longitude'!$B$5:$L$1001,11,FALSE),\"No Change\"))","v":""}]
[null,null,{"$f":"IF(B40=\"\",\"\",IFERROR(VLOOKUP($B40,'Latitude & Longitude'!$B$5:$L$1001,7,FALSE),\"No Change\"))","v":""},{"$f":"IF(B40=\"\",\"\",IFERROR(VLOOKUP($B40,'Latitude & Longitude'!$B$5:$L$1001,11,FALSE),\"No Change\"))","v":""}]
[null,null,{"$f":"IF(B41=\"\",\"\",IFERROR(VLOOKUP($B41,'Latitude & Longitude'!$B$5:$L$1001,7,FALSE),\"No Change\"))","v":""},{"$f":"IF(B41=\"\",\"\",IFERROR(VLOOKUP($B41,'Latitude & Longitude'!$B$5:$L$1001,11,FALSE),\"No Change\"))","v":""}]
[null,null,{"$f":"IF(B42=\"\",\"\",IFERROR(VLOOKUP($B42,'Latitude & Longitude'!$B$5:$L$1001,7,FALSE),\"No Change\"))","v":""},{"$f":"IF(B42=\"\",\"\",IFERROR(VLOOKUP($B42,'Latitude & Longitude'!$B$5:$L$1001,11,FALSE),\"No Change\"))","v":""}]
[null,null,{"$f":"IF(B43=\"\",\"\",IFERROR(VLOOKUP($B43,'Latitude & Longitude'!$B$5:$L$1001,7,FALSE),\"No Change\"))","v":""},{"$f":"IF(B43=\"\",\"\",IFERROR(VLOOKUP($B43,'Latitude & Longitude'!$B$5:$L$1001,11,FALSE),\"No Change\"))","v":""}]
[null,null,{"$f":"IF(B44=\"\",\"\",IFERROR(VLOOKUP($B44,'Latitude & Longitude'!$B$5:$L$1001,7,FALSE),\"No Change\"))","v":""},{"$f":"IF(B44=\"\",\"\",IFERROR(VLOOKUP($B44,'Latitude & Longitude'!$B$5:$L$1001,11,FALSE),\"No Change\"))","v":""}]
[null,null,{"$f":"IF(B45=\"\",\"\",IFERROR(VLOOKUP($B45,'Latitude & Longitude'!$B$5:$L$1001,7,FALSE),\"No Change\"))","v":""},{"$f":"IF(B45=\"\",\"\",IFERROR(VLOOKUP($B45,'Latitude & Longitude'!$B$5:$L$1001,11,FALSE),\"No Change\"))","v":""}]
[null,null,{"$f":"IF(B46=\"\",\"\",IFERROR(VLOOKUP($B46,'Latitude & Longitude'!$B$5:$L$1001,7,FALSE),\"No Change\"))","v":""},{"$f":"IF(B46=\"\",\"\",IFERROR(VLOOKUP($B46,'Latitude & Longitude'!$B$5:$L$1001,11,FALSE),\"No Change\"))","v":""}]
[null,null,{"$f":"IF(B47=\"\",\"\",IFERROR(VLOOKUP($B47,'Latitude & Longitude'!$B$5:$L$1001,7,FALSE),\"No Change\"))","v":""},{"$f":"IF(B47=\"\",\"\",IFERROR(VLOOKUP($B47,'Latitude & Longitude'!$B$5:$L$1001,11,FALSE),\"No Change\"))","v":""}]
[null,null,{"$f":"IF(B48=\"\",\"\",IFERROR(VLOOKUP($B48,'Latitude & Longitude'!$B$5:$L$1001,7,FALSE),\"No Change\"))","v":""},{"$f":"IF(B48=\"\",\"\",IFERROR(VLOOKUP($B48,'Latitude & Longitude'!$B$5:$L$1001,11,FALSE),\"No Change\"))","v":""}]
[null,null,{"$f":"IF(B49=\"\",\"\",IFERROR(VLOOKUP($B49,'Latitude & Longitude'!$B$5:$L$1001,7,FALSE),\"No Change\"))","v":""},{"$f":"IF(B49=\"\",\"\",IFERROR(VLOOKUP($B49,'Latitude & Longitude'!$B$5:$L$1001,11,FALSE),\"No Change\"))","v":""}]
[null,null,{"$f":"IF(B50=\"\",\"\",IFERROR(VLOOKUP($B50,'Latitude & Longitude'!$B$5:$L$1001,7,FALSE),\"No Change\"))","v":""},{"$f":"IF(B50=\"\",\"\",IFERROR(VLOOKUP($B50,'Latitude & Longitude'!$B$5:$L$1001,11,FALSE),\"No Change\"))","v":""}]
[null,null,{"$f":"IF(B51=\"\",\"\",IFERROR(VLOOKUP($B51,'Latitude & Longitude'!$B$5:$L$1001,7,FALSE),\"No Change\"))","v":""},{"$f":"IF(B51=\"\",\"\",IFERROR(VLOOKUP($B51,'Latitude & Longitude'!$B$5:$L$1001,11,FALSE),\"No Change\"))","v":""}]
[null,null,{"$f":"IF(B52=\"\",\"\",IFERROR(VLOOKUP($B52,'Latitude & Longitude'!$B$5:$L$1001,7,FALSE),\"No Change\"))","v":""},{"$f":"IF(B52=\"\",\"\",IFERROR(VLOOKUP($B52,'Latitude & Longitude'!$B$5:$L$1001,11,FALSE),\"No Change\"))","v":""}]
[null,null,{"$f":"IF(B53=\"\",\"\",IFERROR(VLOOKUP($B53,'Latitude & Longitude'!$B$5:$L$1001,7,FALSE),\"No Change\"))","v":""},{"$f":"IF(B53=\"\",\"\",IFERROR(VLOOKUP($B53,'Latitude & Longitude'!$B$5:$L$1001,11,FALSE),\"No Change\"))","v":""}]
[null,null,{"$f":"IF(B54=\"\",\"\",IFERROR(VLOOKUP($B54,'Latitude & Longitude'!$B$5:$L$1001,7,FALSE),\"No Change\"))","v":""},{"$f":"IF(B54=\"\",\"\",IFERROR(VLOOKUP($B54,'Latitude & Longitude'!$B$5:$L$1001,11,FALSE),\"No Change\"))","v":""}]
[null,null,{"$f":"IF(B55=\"\",\"\",IFERROR(VLOOKUP($B55,'Latitude & Longitude'!$B$5:$L$1001,7,FALSE),\"No Change\"))","v":""},{"$f":"IF(B55=\"\",\"\",IFERROR(VLOOKUP($B55,'Latitude & Longitude'!$B$5:$L$1001,11,FALSE),\"No Change\"))","v":""}]
[null,"< Click '+' for more rows","Upper Limit:"]
[null,null,"Lower Limit:"]
[null,null,"Class:"]

{"sheet":"ENR 3 Temp","index":6,"n_rows":207,"n_cols":16,"rows_kept":207,"cut":false,"hidden":true,"merged":[[209,2,209,3],[205,2,205,3],[206,4,206,5],[206,8,208,8],[207,1,208,1],[207,2,208,2],[207,3,208,3],[207,4,208,4],[201,2,201,3],[202,4,202,5],[202,8,204,8],[203,1,204,1],[203,2,204,2],[203,3,204,3],[203,4,204,4],[199,3,200,3],[199,4,200,4],[193,2,193,3],[194,4,194,5],[194,8,196,8],[195,1,196,1],[195,2,196,2],[195,3,196,3],[195,4,196,4],[197,2,197,3],[198,4,198,5],[198,8,200,8],[199,1,200,1],[199,2,200,2],[189,2,189,3],[190,4,190,5],[190,8,192,8],[191,1,192,1],[191,2,192,2],[191,3,192,3],[191,4,192,4],[185,2,185,3],[186,4,186,5],[186,8,188,8],[187,1,188,1],[187,2,188,2],[187,3,188,3],[187,4,188,4],[181,2,181,3],[182,4,182,5],[182,8,184,8],[183,1,184,1],[183,2,184,2],[183,3,184,3],[183,4,184,4],[177,2,177,3],[178,4,178,5],[178,8,180,8],[179,1,180,1],[179,2,180,2],[179,3,180,3],[179,4,180,4],[173,2,173,3],[174,4,174,5],[174,8,176,8],[175,1,176,1],[175,2,176,2],[175,3,176,3],[175,4,176,4],[169,2,169,3],[170,4,170,5],[170,8,172,8],[171,1,172,1],[171,2,172,2],[171,3,172,3],[171,4,172,4],[165,2,165,3],[166,4,166,5],[166,8,168,8],[167,1,168,1],[167,2,168,2],[167,3,168,3],[167,4,168,4],[161,2,161,3],[162,4,162,5],[162,8,164,8],[163,1,164,1],[163,2,164,2],[163,3,164,3],[163,4,164,4],[157,2,157,3],[158,4,158,5],[158,8,160,8],[159,1,160,1],[159,2,160,2],[159,3,160,3],[159,4,160,4],[153,2,153,3],[154,4,154,5],[154,8,156,8],[155,1,156,1],[155,2,156,2],[155,3,156,3],[155,4,156,4],[149,2,149,3],[150,4,150,5],[150,8,152,8],[151,1,152,1],[151,2,152,2],[151,3,152,3],[151,4,152,4],[145,2,145,3],[146,4,146,5],[146,8,148,8],[147,1,148,1],[147,2,148,2],[147,3,148,3],[147,4,148,4],[141,2,141,3],[142,4,142,5],[142,8,144,8],[143,1,144,1],[143,2,144,2],[143,3,144,3],[143,4,144,4],[137,2,137,3],[138,4,138,5],[138,8,140,8],[139,1,140,1],[139,2,140,2],[139,3,140,3],[139,4,140,4],[133,2,133,3],[134,4,134,5],[134,8,136,8],[135,1,136,1],[135,2,136,2],[135,3,136,3],[135,4,136,4],[129,2,129,3],[130,4,130,5],[130,8,132,8],[131,1,132,1],[131,2,132,2],[131,3,132,3],[131,4,132,4],[125,2,125,3],[126,4,126,5],[126,8,128,8],[127,1,128,1],[127,2,128,2],[127,3,128,3],[127,4,128,4],[121,2,121,3],[122,4,122,5],[122,8,124,8],[123,1,124,1],[123,2,124,2],[123,3,124,3],[123,4,124,4],[117,2,117,3],[118,4,118,5],[118,8,120,8],[119,1,120,1],[119,2,120,2],[119,3,120,3],[119,4,120,4],[113,2,113,3],[114,4,114,5],[114,8,116,8],[115,1,116,1],[115,2,116,2],[115,3,116,3],[115,4,116,4],[109,2,109,3],[110,4,110,5],[110,8,112,8],[111,1,112,1],[111,2,112,2],[111,3,112,3],[111,4,112,4],[105,2,105,3],[106,4,106,5],[106,8,108,8],[107,1,108,1],[107,2,108,2],[107,3,108,3],[107,4,108,4],[101,2,101,3],[102,4,102,5],[102,8,104,8],[103,1,104,1],[103,2,104,2],[103,3,104,3],[103,4,104,4],[97,2,97,3],[98,4,98,5],[98,8,100,8],[99,1,100,1],[99,2,100,2],[99,3,100,3],[99,4,100,4],[93,2,93,3],[94,4,94,5],[94,8,96,8],[95,1,96,1],[95,2,96,2],[95,3,96,3],[95,4,96,4],[89,2,89,3],[90,4,90,5],[90,8,92,8],[91,1,92,1],[91,2,92,2],[91,3,92,3],[91,4,92,4],[85,2,85,3],[86,4,86,5],[86,8,88,8],[87,1,88,1],[87,2,88,2],[87,3,88,3],[87,4,88,4],[81,2,81,3],[82,4,82,5],[82,8,84,8],[83,1,84,1],[83,2,84,2],[83,3,84,3],[83,4,84,4],[77,2,77,3],[78,4,78,5],[78,8,80,8],[79,1,80,1],[79,2,80,2],[79,3,80,3],[79,4,80,4],[73,2,73,3],[74,4,74,5],[74,8,76,8],[75,1,76,1],[75,2,76,2],[75,3,76,3],[75,4,76,4],[69,2,69,3],[70,4,70,5],[70,8,72,8],[71,1,72,1],[71,2,72,2],[71,3,72,3],[71,4,72,4],[65,2,65,3],[66,4,66,5],[66,8,68,8],[67,1,68,1],[67,2,68,2],[67,3,68,3],[67,4,68,4],[61,2,61,3],[62,4,62,5],[62,8,64,8],[63,1,64,1],[63,2,64,2],[63,3,64,3],[63,4,64,4],[57,2,57,3],[58,4,58,5],[58,8,60,8],[59,1,60,1],[59,2,60,2],[59,3,60,3],[59,4,60,4],[53,2,53,3],[54,4,54,5],[54,8,56,8],[55,1,56,1],[55,2,56,2],[55,3,56,3],[55,4,56,4],[49,2,49,3],[50,4,50,5],[50,8,52,8],[51,1,52,1],[51,2,52,2],[51,3,52,3],[51,4,52,4],[45,2,45,3],[46,4,46,5],[46,8,48,8],[47,1,48,1],[47,2,48,2],[47,3,48,3],[47,4,48,4],[41,2,41,3],[42,4,42,5],[42,8,44,8],[43,1,44,1],[43,2,44,2],[43,3,44,3],[43,4,44,4],[37,2,37,3],[38,4,38,5],[38,8,40,8],[39,1,40,1],[39,2,40,2],[39,3,40,3],[39,4,40,4],[33,2,33,3],[34,4,34,5],[34,8,36,8],[35,1,36,1],[35,2,36,2],[35,3,36,3],[35,4,36,4],[29,2,29,3],[30,4,30,5],[30,8,32,8],[31,1,32,1],[31,2,32,2],[31,3,32,3],[31,4,32,4],[25,2,25,3],[26,4,26,5],[26,8,28,8],[27,1,28,1],[27,2,28,2],[27,3,28,3],[27,4,28,4],[21,2,21,3],[22,4,22,5],[22,8,24,8],[23,1,24,1],[23,2,24,2],[23,3,24,3],[23,4,24,4],[17,2,17,3],[18,4,18,5],[18,8,20,8],[19,1,20,1],[19,2,20,2],[19,3,20,3],[19,4,20,4],[14,4,14,5],[14,8,16,8],[15,1,16,1],[15,2,16,2],[15,3,16,3],[15,4,16,4],[11,1,12,1],[11,2,12,2],[11,3,12,3],[11,4,12,4],[4,9,5,9],[4,10,5,10],[10,8,12,8],[1,2,1,3],[4,1,5,1],[10,4,10,5],[7,2,7,3],[13,2,13,3],[2,2,2,3],[6,2,6,8],[8,2,8,3],[8,6,8,7],[7,5,7,8],[2,5,2,8],[1,9,1,10],[2,9,2,10],[9,6,9,7]]}
[null,null,null,null,null,null,null,null,null,null,null,null,null,"All_FLs","Odd_FLs","Even_FLs"]
[null,"1a. ENR Section:","1b. Name of Route:",null,null,{"$f":"\"2a. Partial or complete description of \"&C3&\":\"","v":"2a. Partial or complete description of :"},null,null,null,{"$f":"IF(F3=\"Partial\",\"2b. Describe parts of \"&C3&\" not included in this entry (therefore assumed unchanged):\",\"2b. N/A\")","v":"2b. N/A"},null,null,"Select FL:","Odd","Even"]
[null,null,null,null,null,null,null,null,null,null,null,null,"FL 5","Select Odd FL:","Select Even FL"]
[null,null,null,null,null,null,null,null,null,null,null,null,null,"FL 35","FL 50","FL 40"]
[null,null,{"$f":"IF(B3=\"\",\"\",B3)","v":""},null,null,null,"Note: Ensure route is listed south-north",null,null,{"$f":"\"A total of \"&COUNTIF(J10:J209,\"Yes\")","v":"A total of 0"},null,null,null,"FL 40","FL 70","FL 60"]
[null,null,"Only one named airspace per worksheet - additional sheets are added via the Content and Approval tab. ",null,null,null,null,null,null,null,null,null,null,"FL 45","FL 90","FL 80"]
[null,"Route Designator\n(RNP/RNAV Type)",null,null,null,null,null,null,null,"CAA issues to resolve?","Additional CAA Comments",null,null,"FL 50","FL 110","FL 100"]
["∆","Significant Point Name \n","Significant Point Coordinates\n",null,null,"Waypoint: Ident of VOR/DME\nBRG, DIST & ELEV of DME antenna",null,null,null,null,null,null,null,"FL 55","FL 130","FL 120"]
[null,"(RNP/RNAV) Type & Accuracy\nSouth\n   ↓\nNorth\n","TRUE TRACK°\n\n↓                           ↑\nFWD°                     REV°\n(Northbound)        (Southbound)",null,"Geodetic Distance\n(NM)","Upper limit\n\nLower Limit","FL Series\nIFR Crusing levels\nEven/Odd\nmax            max\nmin            min",null,"Remarks/\nControlling Unit/Channel/\nLogon address/SATVOICE number\nRCP and RSP limitations\nAirspace Class",null,null,null,null,"FL 60","FL 150","FL 140"]
[null,{"$f":"C3&CHAR(10)&\"(RNP/RNAV)\"","v":"\n(RNP/RNAV)"},null,null,null,null,null,null,null,null,null,null,null,"FL 65","FL 170","FL 160"]
[{"$f":"IF(B11=\"\",\"\",\"∆\")","v":""},null,{"$f":"IF(B11=\"\",\"\",IFERROR(VLOOKUP($B11,'Latitude & Longitude'!$B$5:$H$204,7,FALSE),\"No Change\"))","v":""},{"$f":"IF(B11=\"\",\"\",IFERROR(VLOOKUP($B11,'Latitude & Longitude'!$B$5:$L$204,11,FALSE),\"No Change\"))","v":""},"x",null,null,null,null,null,null,null,null,"FL 70","FL 190","FL 180"]
[null,null,null,null,null,null,null,null,null,null,null,null,null,"FL 75","FL 210","FL 200"]
[null,null,null,null,null,null,null,null,null,null,null,null,null,"FL 80","FL 230","FL 220"]
[null,null,null,null,null,null,null,null,null,null,null,null,null,"FL 85","FL 250","FL 240"]
[{"$f":"IF(B15=\"\",\"\",\"∆\")","v":""},null,{"$f":"IF(B15=\"\",\"\",IFERROR(VLOOKUP($B15,'Latitude & Longitude'!$B$5:$H$204,7,FALSE),\"No Change\"))","v":""},{"$f":"IF(B15=\"\",\"\",IFERROR(VLOOKUP($B15,'Latitude & Longitude'!$B$5:$L$204,11,FALSE),\"No Change\"))","v":""},"x",null,null,null,null,null,null,null,null,"FL 90","FL 270","FL 260"]
[null,null,null,null,null,null,null,null,null,null,null,null,null,"FL 95","FL 290","FL 280"]
[null,null,null,null,null,null,null,null,null,null,null,null,null,"FL 100","FL 310","FL 300"]
[{"$f":"IF(B17=\"\",\"\",\"∆\")","v":""},null,null,null,null,null,null,null,null,null,null,null,null,"FL 105","FL 330","FL 320"]
[{"$f":"IF(B19=\"\",\"\",\"∆\")","v":""},null,{"$f":"IF(B19=\"\",\"\",IFERROR(VLOOKUP($B19,'Latitude & Longitude'!$B$5:$H$204,7,FALSE),\"No Change\"))","v":""},{"$f":"IF(B19=\"\",\"\",IFERROR(VLOOKUP($B19,'Latitude & Longitude'!$B$5:$L$204,11,FALSE),\"No Change\"))","v":""},"x",null,null,null,null,null,null,null,null,"FL 110","FL 350","FL 340"]
[null,null,null,null,null,null,null,null,null,null,null,null,null,"FL 115","FL 370","FL 360"]
[null,null,null,null,null,null,null,null,null,null,null,null,null,"FL 120","FL 390","FL 380"]
[{"$f":"IF(B21=\"\",\"\",\"∆\")","v":""},null,null,null,null,null,null,null,null,null,null,null,null,"FL 125","FL 410","FL 400"]
[{"$f":"IF(B23=\"\",\"\",\"∆\")","v":""},null,{"$f":"IF(B23=\"\",\"\",IFERROR(VLOOKUP($B23,'Latitude & Longitude'!$B$5:$H$204,7,FALSE),\"No Change\"))","v":""},{"$f":"IF(B23=\"\",\"\",IFERROR(VLOOKUP($B23,'Latitude & Longitude'!$B$5:$L$204,11,FALSE),\"No Change\"))","v":""},"x",null,null,null,null,null,null,null,null,"FL 130","FL 450","FL 430"]
[null,null,null,null,null,null,null,null,null,null,null,null,null,"FL 135"]
[null,null,null,null,null,null,null,null,null,null,null,null,null,"FL 140"]
[{"$f":"IF(B25=\"\",\"\",\"∆\")","v":""},null,null,null,null,null,null,null,null,null,null,null,null,"FL 145"]
[{"$f":"IF(B27=\"\",\"\",\"∆\")","v":""},null,{"$f":"IF(B27=\"\",\"\",IFERROR(VLOOKUP($B27,'Latitude & Longitude'!$B$5:$H$204,7,FALSE),\"No Change\"))","v":""},{"$f":"IF(B27=\"\",\"\",IFERROR(VLOOKUP($B27,'Latitude & Longitude'!$B$5:$L$204,11,FALSE),\"No Change\"))","v":""},"x",null,null,null,null,null,null,null,null,"FL 150"]
[null,null,null,null,null,null,null,null,null,null,null,null,null,"FL 155"]
[null,null,null,null,null,null,null,null,null,null,null,null,null,"FL 160"]
[{"$f":"IF(B29=\"\",\"\",\"∆\")","v":""},null,null,null,null,null,null,null,null,null,null,null,null,"FL 165"]
[{"$f":"IF(B31=\"\",\"\",\"∆\")","v":""},null,{"$f":"IF(B31=\"\",\"\",IFERROR(VLOOKUP($B31,'Latitude & Longitude'!$B$5:$H$204,7,FALSE),\"No Change\"))","v":""},{"$f":"IF(B31=\"\",\"\",IFERROR(VLOOKUP($B31,'Latitude & Longitude'!$B$5:$L$204,11,FALSE),\"No Change\"))","v":""},"x",null,null,null,null,null,null,null,null,"FL 170"]
[null,null,null,null,null,null,null,null,null,null,null,null,null,"FL 175"]
[null,null,null,null,null,null,null,null,null,null,null,null,null,"FL 180"]
[{"$f":"IF(B33=\"\",\"\",\"∆\")","v":""},null,null,null,null,null,null,null,null,null,null,null,null,"FL 185"]
[{"$f":"IF(B35=\"\",\"\",\"∆\")","v":""},null,{"$f":"IF(B35=\"\",\"\",IFERROR(VLOOKUP($B35,'Latitude & Longitude'!$B$5:$H$204,7,FALSE),\"No Change\"))","v":""},{"$f":"IF(B35=\"\",\"\",IFERROR(VLOOKUP($B35,'Latitude & Longitude'!$B$5:$L$204,11,FALSE),\"No Change\"))","v":""},"x",null,null,null,null,null,null,null,null,"FL 190"]
[null,null,null,null,null,null,null,null,null,null,null,null,null,"FL 195"]
[null,null,null,null,null,null,null,null,null,null,null,null,null,"FL 200"]
[{"$f":"IF(B37=\"\",\"\",\"∆\")","v":""},null,null,null,null,null,null,null,null,null,null,null,null,"FL 205"]
[{"$f":"IF(B39=\"\",\"\",\"∆\")","v":""},null,{"$f":"IF(B39=\"\",\"\",IFERROR(VLOOKUP($B39,'Latitude & Longitude'!$B$5:$H$204,7,FALSE),\"No Change\"))","v":""},{"$f":"IF(B39=\"\",\"\",IFERROR(VLOOKUP($B39,'Latitude & Longitude'!$B$5:$L$204,11,FALSE),\"No Change\"))","v":""},"x",null,null,null,null,null,null,null,null,"FL 210"]
[null,null,null,null,null,null,null,null,null,null,null,null,null,"FL 215"]
[null,null,null,null,null,null,null,null,null,null,null,null,null,"FL 220"]
[{"$f":"IF(B41=\"\",\"\",\"∆\")","v":""},null,null,null,null,null,null,null,null,null,null,null,null,"FL 225"]
[{"$f":"IF(B43=\"\",\"\",\"∆\")","v":""},null,{"$f":"IF(B43=\"\",\"\",IFERROR(VLOOKUP($B43,'Latitude & Longitude'!$B$5:$H$204,7,FALSE),\"No Change\"))","v":""},{"$f":"IF(B43=\"\",\"\",IFERROR(VLOOKUP($B43,'Latitude & Longitude'!$B$5:$L$204,11,FALSE),\"No Change\"))","v":""},"x",null,null,null,null,null,null,null,null,"FL 230"]
[null,null,null,null,null,null,null,null,null,null,null,null,null,"FL 235"]
[null,null,null,null,null,null,null,null,null,null,null,null,null,"FL 240"]
[{"$f":"IF(B45=\"\",\"\",\"∆\")","v":""},null,null,null,null,null,null,null,null,null,null,null,null,"FL 245"]
[{"$f":"IF(B47=\"\",\"\",\"∆\")","v":""},null,{"$f":"IF(B47=\"\",\"\",IFERROR(VLOOKUP($B47,'Latitude & Longitude'!$B$5:$H$204,7,FALSE),\"No Change\"))","v":""},{"$f":"IF(B47=\"\",\"\",IFERROR(VLOOKUP($B47,'Latitude & Longitude'!$B$5:$L$204,11,FALSE),\"No Change\"))","v":""},"x",null,null,null,null,null,null,null,null,"FL 250"]
[null,null,null,null,null,null,null,null,null,null,null,null,null,"FL 255"]
[null,null,null,null,null,null,null,null,null,null,null,null,null,"FL 260"]
[{"$f":"IF(B49=\"\",\"\",\"∆\")","v":""},null,null,null,null,null,null,null,null,null,null,null,null,"FL 265"]
[{"$f":"IF(B51=\"\",\"\",\"∆\")","v":""},null,{"$f":"IF(B51=\"\",\"\",IFERROR(VLOOKUP($B51,'Latitude & Longitude'!$B$5:$H$204,7,FALSE),\"No Change\"))","v":""},{"$f":"IF(B51=\"\",\"\",IFERROR(VLOOKUP($B51,'Latitude & Longitude'!$B$5:$L$204,11,FALSE),\"No Change\"))","v":""},"x",null,null,null,null,null,null,null,null,"FL 270"]
[null,null,null,null,null,null,null,null,null,null,null,null,null,"FL 275"]
[null,null,null,null,null,null,null,null,null,null,null,null,null,"FL 280"]
[{"$f":"IF(B53=\"\",\"\",\"∆\")","v":""},null,null,null,null,null,null,null,null,null,null,null,null,"FL 285"]
[{"$f":"IF(B55=\"\",\"\",\"∆\")","v":""},null,{"$f":"IF(B55=\"\",\"\",IFERROR(VLOOKUP($B55,'Latitude & Longitude'!$B$5:$H$204,7,FALSE),\"No Change\"))","v":""},{"$f":"IF(B55=\"\",\"\",IFERROR(VLOOKUP($B55,'Latitude & Longitude'!$B$5:$L$204,11,FALSE),\"No Change\"))","v":""},"x",null,null,null,null,null,null,null,null,"FL 290"]
[null,null,null,null,null,null,null,null,null,null,null,null,null,"FL 295"]
[null,null,null,null,null,null,null,null,null,null,null,null,null,"FL 300"]
[{"$f":"IF(B57=\"\",\"\",\"∆\")","v":""},null,null,null,null,null,null,null,null,null,null,null,null,"FL 305"]
[{"$f":"IF(B59=\"\",\"\",\"∆\")","v":""},null,{"$f":"IF(B59=\"\",\"\",IFERROR(VLOOKUP($B59,'Latitude & Longitude'!$B$5:$H$204,7,FALSE),\"No Change\"))","v":""},{"$f":"IF(B59=\"\",\"\",IFERROR(VLOOKUP($B59,'Latitude & Longitude'!$B$5:$L$204,11,FALSE),\"No Change\"))","v":""},"x",null,null,null,null,null,null,null,null,"FL 310"]
[null,null,null,null,null,null,null,null,null,null,null,null,null,"FL 315"]
[null,null,null,null,null,null,null,null,null,null,null,null,null,"FL 320"]
[{"$f":"IF(B61=\"\",\"\",\"∆\")","v":""},null,null,null,null,null,null,null,null,null,null,null,null,"FL 325"]
[{"$f":"IF(B63=\"\",\"\",\"∆\")","v":""},null,{"$f":"IF(B63=\"\",\"\",IFERROR(VLOOKUP($B63,'Latitude & Longitude'!$B$5:$H$204,7,FALSE),\"No Change\"))","v":""},{"$f":"IF(B63=\"\",\"\",IFERROR(VLOOKUP($B63,'Latitude & Longitude'!$B$5:$L$204,11,FALSE),\"No Change\"))","v":""},"x",null,null,null,null,null,null,null,null,"FL 330"]
[null,null,null,null,null,null,null,null,null,null,null,null,null,"FL 335"]
[null,null,null,null,null,null,null,null,null,null,null,null,null,"FL 340"]
[{"$f":"IF(B65=\"\",\"\",\"∆\")","v":""},null,null,null,null,null,null,null,null,null,null,null,null,"FL 345"]
[{"$f":"IF(B67=\"\",\"\",\"∆\")","v":""},null,{"$f":"IF(B67=\"\",\"\",IFERROR(VLOOKUP($B67,'Latitude & Longitude'!$B$5:$H$204,7,FALSE),\"No Change\"))","v":""},{"$f":"IF(B67=\"\",\"\",IFERROR(VLOOKUP($B67,'Latitude & Longitude'!$B$5:$L$204,11,FALSE),\"No Change\"))","v":""},"x",null,null,null,null,null,null,null,null,"FL 350"]
[null,null,null,null,null,null,null,null,null,null,null,null,null,"FL 355"]
[null,null,null,null,null,null,null,null,null,null,null,null,null,"FL 360"]
[{"$f":"IF(B69=\"\",\"\",\"∆\")","v":""},null,null,null,null,null,null,null,null,null,null,null,null,"FL 365"]
[{"$f":"IF(B71=\"\",\"\",\"∆\")","v":""},null,{"$f":"IF(B71=\"\",\"\",IFERROR(VLOOKUP($B71,'Latitude & Longitude'!$B$5:$H$204,7,FALSE),\"No Change\"))","v":""},{"$f":"IF(B71=\"\",\"\",IFERROR(VLOOKUP($B71,'Latitude & Longitude'!$B$5:$L$204,11,FALSE),\"No Change\"))","v":""},"x",null,null,null,null,null,null,null,null,"FL 370"]
[null,null,null,null,null,null,null,null,null,null,null,null,null,"FL 375"]
[null,null,null,null,null,null,null,null,null,null,null,null,null,"FL 380"]
[{"$f":"IF(B73=\"\",\"\",\"∆\")","v":""},null,null,null,null,null,null,null,null,null,null,null,null,"FL 385"]
[{"$f":"IF(B75=\"\",\"\",\"∆\")","v":""},null,{"$f":"IF(B75=\"\",\"\",IFERROR(VLOOKUP($B75,'Latitude & Longitude'!$B$5:$H$204,7,FALSE),\"No Change\"))","v":""},{"$f":"IF(B75=\"\",\"\",IFERROR(VLOOKUP($B75,'Latitude & Longitude'!$B$5:$L$204,11,FALSE),\"No Change\"))","v":""},"x",null,null,null,null,null,null,null,null,"FL 390"]
[null,null,null,null,null,null,null,null,null,null,null,null,null,"FL 395"]
[null,null,null,null,null,null,null,null,null,null,null,null,null,"FL 400"]
[{"$f":"IF(B77=\"\",\"\",\"∆\")","v":""},null,null,null,null,null,null,null,null,null,null,null,null,"FL 405"]
[{"$f":"IF(B79=\"\",\"\",\"∆\")","v":""},null,{"$f":"IF(B79=\"\",\"\",IFERROR(VLOOKUP($B79,'Latitude & Longitude'!$B$5:$H$204,7,FALSE),\"No Change\"))","v":""},{"$f":"IF(B79=\"\",\"\",IFERROR(VLOOKUP($B79,'Latitude & Longitude'!$B$5:$L$204,11,FALSE),\"No Change\"))","v":""},"x",null,null,null,null,null,null,null,null,"FL 410"]
[null,null,null,null,null,null,null,null,null,null,null,null,null,"FL 415"]
[null,null,null,null,null,null,null,null,null,null,null,null,null,"FL 420"]
[{"$f":"IF(B81=\"\",\"\",\"∆\")","v":""},null,null,null,null,null,null,null,null,null,null,null,null,"FL 425"]
[{"$f":"IF(B83=\"\",\"\",\"∆\")","v":""},null,{"$f":"IF(B83=\"\",\"\",IFERROR(VLOOKUP($B83,'Latitude & Longitude'!$B$5:$H$204,7,FALSE),\"No Change\"))","v":""},{"$f":"IF(B83=\"\",\"\",IFERROR(VLOOKUP($B83,'Latitude & Longitude'!$B$5:$L$204,11,FALSE),\"No Change\"))","v":""},"x",null,null,null,null,null,null,null,null,"FL 430"]
[null,null,null,null,null,null,null,null,null,null,null,null,null,"FL 435"]
[null,null,null,null,null,null,null,null,null,null,null,null,null,"FL 440"]
[{"$f":"IF(B85=\"\",\"\",\"∆\")","v":""},null,null,null,null,null,null,null,null,null,null,null,null,"FL 445"]
[{"$f":"IF(B87=\"\",\"\",\"∆\")","v":""},null,{"$f":"IF(B87=\"\",\"\",IFERROR(VLOOKUP($B87,'Latitude & Longitude'!$B$5:$L$204,7,FALSE),\"No Change\"))","v":""},{"$f":"IF(B87=\"\",\"\",IFERROR(VLOOKUP($B87,'Latitude & Longitude'!$B$5:$L$204,11,FALSE),\"No Change\"))","v":""},"x",null,null,null,null,null,null,null,null,"FL 450"]
[null,null,null,null,null,null,null,null,null,null,null,null,null,"FL 455"]
[null,null,null,null,null,null,null,null,null,null,null,null,null,"FL 460"]
[{"$f":"IF(B89=\"\",\"\",\"∆\")","v":""}]
[{"$f":"IF(B91=\"\",\"\",\"∆\")","v":""},null,{"$f":"IF(B91=\"\",\"\",IFERROR(VLOOKUP($B91,'Latitude & Longitude'!$B$5:$H$204,7,FALSE),\"No Change\"))","v":""},{"$f":"IF(B91=\"\",\"\",IFERROR(VLOOKUP($B91,'Latitude & Longitude'!$B$5:$L$204,11,FALSE),\"No Change\"))","v":""},"x"]
[]
[]
[{"$f":"IF(B93=\"\",\"\",\"∆\")","v":""}]
[{"$f":"IF(B95=\"\",\"\",\"∆\")","v":""},null,{"$f":"IF(B95=\"\",\"\",IFERROR(VLOOKUP($B95,'Latitude & Longitude'!$B$5:$H$204,7,FALSE),\"No Change\"))","v":""},{"$f":"IF(B95=\"\",\"\",IFERROR(VLOOKUP($B95,'Latitude & Longitude'!$B$5:$L$204,11,FALSE),\"No Change\"))","v":""},"x"]
[]
[]
[{"$f":"IF(B97=\"\",\"\",\"∆\")","v":""}]
[{"$f":"IF(B99=\"\",\"\",\"∆\")","v":""},null,{"$f":"IF(B99=\"\",\"\",IFERROR(VLOOKUP($B99,'Latitude & Longitude'!$B$5:$H$204,7,FALSE),\"No Change\"))","v":""},{"$f":"IF(B99=\"\",\"\",IFERROR(VLOOKUP($B99,'Latitude & Longitude'!$B$5:$L$204,11,FALSE),\"No Change\"))","v":""},"x"]
[]
[]
[{"$f":"IF(B101=\"\",\"\",\"∆\")","v":""}]
[{"$f":"IF(B103=\"\",\"\",\"∆\")","v":""},null,{"$f":"IF(B103=\"\",\"\",IFERROR(VLOOKUP($B103,'Latitude & Longitude'!$B$5:$H$204,7,FALSE),\"No Change\"))","v":""},{"$f":"IF(B103=\"\",\"\",IFERROR(VLOOKUP($B103,'Latitude & Longitude'!$B$5:$L$204,11,FALSE),\"No Change\"))","v":""},"x"]
[]
[]
[{"$f":"IF(B105=\"\",\"\",\"∆\")","v":""}]
[{"$f":"IF(B107=\"\",\"\",\"∆\")","v":""},null,{"$f":"IF(B107=\"\",\"\",IFERROR(VLOOKUP($B107,'Latitude & Longitude'!$B$5:$H$204,7,FALSE),\"No Change\"))","v":""},{"$f":"IF(B107=\"\",\"\",IFERROR(VLOOKUP($B107,'Latitude & Longitude'!$B$5:$L$204,11,FALSE),\"No Change\"))","v":""},"x"]
[]
[]
[]
[{"$f":"IF(B111=\"\",\"\",\"∆\")","v":""},null,{"$f":"IF(B111=\"\",\"\",IFERROR(VLOOKUP($B111,'Latitude & Longitude'!$B$5:$H$204,7,FALSE),\"No Change\"))","v":""},{"$f":"IF(B111=\"\",\"\",IFERROR(VLOOKUP($B111,'Latitude & Longitude'!$B$5:$L$204,11,FALSE),\"No Change\"))","v":""},"x"]
[]
[]
[]
[{"$f":"IF(B115=\"\",\"\",\"∆\")","v":""},null,{"$f":"IF(B115=\"\",\"\",IFERROR(VLOOKUP($B115,'Latitude & Longitude'!$B$5:$H$204,7,FALSE),\"No Change\"))","v":""},{"$f":"IF(B115=\"\",\"\",IFERROR(VLOOKUP($B115,'Latitude & Longitude'!$B$5:$L$204,11,FALSE),\"No Change\"))","v":""},"x"]
[]
[]
[]
[{"$f":"IF(B119=\"\",\"\",\"∆\")","v":""},null,{"$f":"IF(B119=\"\",\"\",IFERROR(VLOOKUP($B119,'Latitude & Longitude'!$B$5:$H$204,7,FALSE),\"No Change\"))","v":""},{"$f":"IF(B119=\"\",\"\",IFERROR(VLOOKUP($B119,'Latitude & Longitude'!$B$5:$L$204,11,FALSE),\"No Change\"))","v":""},"x"]
[]
[]
[]
[{"$f":"IF(B123=\"\",\"\",\"∆\")","v":""},null,{"$f":"IF(B123=\"\",\"\",IFERROR(VLOOKUP($B123,'Latitude & Longitude'!$B$5:$H$204,7,FALSE),\"No Change\"))","v":""},{"$f":"IF(B123=\"\",\"\",IFERROR(VLOOKUP($B123,'Latitude & Longitude'!$B$5:$L$204,11,FALSE),\"No Change\"))","v":""},"x"]
[]
[]
[]
[{"$f":"IF(B127=\"\",\"\",\"∆\")","v":""},null,{"$f":"IF(B127=\"\",\"\",IFERROR(VLOOKUP($B127,'Latitude & Longitude'!$B$5:$H$204,7,FALSE),\"No Change\"))","v":""},{"$f":"IF(B127=\"\",\"\",IFERROR(VLOOKUP($B127,'Latitude & Longitude'!$B$5:$L$204,11,FALSE),\"No Change\"))","v":""},"x"]
[]
[]
[]
[{"$f":"IF(B131=\"\",\"\",\"∆\")","v":""},null,{"$f":"IF(B131=\"\",\"\",IFERROR(VLOOKUP($B131,'Latitude & Longitude'!$B$5:$H$204,7,FALSE),\"No Change\"))","v":""},{"$f":"IF(B131=\"\",\"\",IFERROR(VLOOKUP($B131,'Latitude & Longitude'!$B$5:$L$204,11,FALSE),\"No Change\"))","v":""},"x"]
[]
[]
[]
[{"$f":"IF(B135=\"\",\"\",\"∆\")","v":""},null,{"$f":"IF(B135=\"\",\"\",IFERROR(VLOOKUP($B135,'Latitude & Longitude'!$B$5:$H$204,7,FALSE),\"No Change\"))","v":""},{"$f":"IF(B135=\"\",\"\",IFERROR(VLOOKUP($B135,'Latitude & Longitude'!$B$5:$L$204,11,FALSE),\"No Change\"))","v":""},"x"]
[]
[]
[]
[{"$f":"IF(B139=\"\",\"\",\"∆\")","v":""},null,{"$f":"IF(B139=\"\",\"\",IFERROR(VLOOKUP($B139,'Latitude & Longitude'!$B$5:$H$204,7,FALSE),\"No Change\"))","v":""},{"$f":"IF(B139=\"\",\"\",IFERROR(VLOOKUP($B139,'Latitude & Longitude'!$B$5:$L$204,11,FALSE),\"No Change\"))","v":""},"x"]
[]
[]
[]
[{"$f":"IF(B143=\"\",\"\",\"∆\")","v":""},null,{"$f":"IF(B143=\"\",\"\",IFERROR(VLOOKUP($B143,'Latitude & Longitude'!$B$5:$H$204,7,FALSE),\"No Change\"))","v":""},{"$f":"IF(B143=\"\",\"\",IFERROR(VLOOKUP($B143,'Latitude & Longitude'!$B$5:$L$204,11,FALSE),\"No Change\"))","v":""},"x"]
[]
[]
[]
[{"$f":"IF(B147=\"\",\"\",\"∆\")","v":""},null,{"$f":"IF(B147=\"\",\"\",IFERROR(VLOOKUP($B147,'Latitude & Longitude'!$B$5:$H$204,7,FALSE),\"No Change\"))","v":""},{"$f":"IF(B147=\"\",\"\",IFERROR(VLOOKUP($B147,'Latitude & Longitude'!$B$5:$L$204,11,FALSE),\"No Change\"))","v":""},"x"]
[]
[]
[]
[{"$f":"IF(B151=\"\",\"\",\"∆\")","v":""},null,{"$f":"IF(B151=\"\",\"\",IFERROR(VLOOKUP($B151,'Latitude & Longitude'!$B$5:$H$204,7,FALSE),\"No Change\"))","v":""},{"$f":"IF(B151=\"\",\"\",IFERROR(VLOOKUP($B151,'Latitude & Longitude'!$B$5:$L$204,11,FALSE),\"No Change\"))","v":""},"x"]
[]
[]
[]
[{"$f":"IF(B155=\"\",\"\",\"∆\")","v":""},null,{"$f":"IF(B155=\"\",\"\",IFERROR(VLOOKUP($B155,'Latitude & Longitude'!$B$5:$H$204,7,FALSE),\"No Change\"))","v":""},{"$f":"IF(B155=\"\",\"\",IFERROR(VLOOKUP($B155,'Latitude & Longitude'!$B$5:$L$204,11,FALSE),\"No Change\"))","v":""},"x"]
[]
[]
[]
[{"$f":"IF(B159=\"\",\"\",\"∆\")","v":""},null,{"$f":"IF(B159=\"\",\"\",IFERROR(VLOOKUP($B159,'Latitude & Longitude'!$B$5:$H$204,7,FALSE),\"No Change\"))","v":""},{"$f":"IF(B159=\"\",\"\",IFERROR(VLOOKUP($B159,'Latitude & Longitude'!$B$5:$L$204,11,FALSE),\"No Change\"))","v":""},"x"]
[]
[]
[]
[{"$f":"IF(B163=\"\",\"\",\"∆\")","v":""},null,{"$f":"IF(B163=\"\",\"\",IFERROR(VLOOKUP($B163,'Latitude & Longitude'!$B$5:$H$204,7,FALSE),\"No Change\"))","v":""},{"$f":"IF(B163=\"\",\"\",IFERROR(VLOOKUP($B163,'Latitude & Longitude'!$B$5:$L$204,11,FALSE),\"No Change\"))","v":""},"x"]
[]
[]
[]
[{"$f":"IF(B167=\"\",\"\",\"∆\")","v":""},null,{"$f":"IF(B167=\"\",\"\",IFERROR(VLOOKUP($B167,'Latitude & Longitude'!$B$5:$H$204,7,FALSE),\"No Change\"))","v":""},{"$f":"IF(B167=\"\",\"\",IFERROR(VLOOKUP($B167,'Latitude & Longitude'!$B$5:$L$204,11,FALSE),\"No Change\"))","v":""},"x"]
[]
[]
[]
[{"$f":"IF(B171=\"\",\"\",\"∆\")","v":""},null,{"$f":"IF(B171=\"\",\"\",IFERROR(VLOOKUP($B171,'Latitude & Longitude'!$B$5:$H$204,7,FALSE),\"No Change\"))","v":""},{"$f":"IF(B171=\"\",\"\",IFERROR(VLOOKUP($B171,'Latitude & Longitude'!$B$5:$L$204,11,FALSE),\"No Change\"))","v":""},"x"]
[]
[]
[]
[{"$f":"IF(B175=\"\",\"\",\"∆\")","v":""},null,{"$f":"IF(B175=\"\",\"\",IFERROR(VLOOKUP($B175,'Latitude & Longitude'!$B$5:$H$204,7,FALSE),\"No Change\"))","v":""},{"$f":"IF(B175=\"\",\"\",IFERROR(VLOOKUP($B175,'Latitude & Longitude'!$B$5:$L$204,11,FALSE),\"No Change\"))","v":""},"x"]
[]
[]
[]
[{"$f":"IF(B179=\"\",\"\",\"∆\")","v":""},null,{"$f":"IF(B179=\"\",\"\",IFERROR(VLOOKUP($B179,'Latitude & Longitude'!$B$5:$H$204,7,FALSE),\"No Change\"))","v":""},{"$f":"IF(B179=\"\",\"\",IFERROR(VLOOKUP($B179,'Latitude & Longitude'!$B$5:$L$204,11,FALSE),\"No Change\"))","v":""},"x"]
[]
[]
[]
[{"$f":"IF(B183=\"\",\"\",\"∆\")","v":""},null,{"$f":"IF(B183=\"\",\"\",IFERROR(VLOOKUP($B183,'Latitude & Longitude'!$B$5:$H$204,7,FALSE),\"No Change\"))","v":""},{"$f":"IF(B183=\"\",\"\",IFERROR(VLOOKUP($B183,'Latitude & Longitude'!$B$5:$L$204,11,FALSE),\"No Change\"))","v":""},"x"]
[]
[]
[]
[{"$f":"IF(B187=\"\",\"\",\"∆\")","v":""},null,{"$f":"IF(B187=\"\",\"\",IFERROR(VLOOKUP($B187,'Latitude & Longitude'!$B$5:$H$204,7,FALSE),\"No Change\"))","v":""},{"$f":"IF(B187=\"\",\"\",IFERROR(VLOOKUP($B187,'Latitude & Longitude'!$B$5:$L$204,11,FALSE),\"No Change\"))","v":""},"x"]
[]
[]
[]
[{"$f":"IF(B191=\"\",\"\",\"∆\")","v":""},null,{"$f":"IF(B191=\"\",\"\",IFERROR(VLOOKUP($B191,'Latitude & Longitude'!$B$5:$H$204,7,FALSE),\"No Change\"))","v":""},{"$f":"IF(B191=\"\",\"\",IFERROR(VLOOKUP($B191,'Latitude & Longitude'!$B$5:$L$204,11,FALSE),\"No Change\"))","v":""},"x"]
[]
[]
[]
[{"$f":"IF(B195=\"\",\"\",\"∆\")","v":""},null,{"$f":"IF(B195=\"\",\"\",IFERROR(VLOOKUP($B195,'Latitude & Longitude'!$B$5:$H$204,7,FALSE),\"No Change\"))","v":""},{"$f":"IF(B195=\"\",\"\",IFERROR(VLOOKUP($B195,'Latitude & Longitude'!$B$5:$L$204,11,FALSE),\"No Change\"))","v":""},"x"]
[]
[]
[]
[{"$f":"IF(B199=\"\",\"\",\"∆\")","v":""},null,{"$f":"IF(B199=\"\",\"\",IFERROR(VLOOKUP($B199,'Latitude & Longitude'!$B$5:$H$204,7,FALSE),\"No Change\"))","v":""},{"$f":"IF(B199=\"\",\"\",IFERROR(VLOOKUP($B199,'Latitude & Longitude'!$B$5:$L$204,11,FALSE),\"No Change\"))","v":""},"x"]
[]
[]
[]
[{"$f":"IF(B203=\"\",\"\",\"∆\")","v":""},null,{"$f":"IF(B203=\"\",\"\",IFERROR(VLOOKUP($B203,'Latitude & Longitude'!$B$5:$H$204,7,FALSE),\"No Change\"))","v":""},{"$f":"IF(B203=\"\",\"\",IFERROR(VLOOKUP($B203,'Latitude & Longitude'!$B$5:$L$204,11,FALSE),\"No Change\"))","v":""},"x"]
[]
[]
[]
[{"$f":"IF(B207=\"\",\"\",\"∆\")","v":""},null,{"$f":"IF(B207=\"\",\"\",IFERROR(VLOOKUP($B207,'Latitude & Longitude'!$B$5:$H$204,7,FALSE),\"No Change\"))","v":""},{"$f":"IF(B207=\"\",\"\",IFERROR(VLOOKUP($B207,'Latitude & Longitude'!$B$5:$L$204,11,FALSE),\"No Change\"))","v":""},"x"]

{"sheet":"ENR 5.1 Temp","index":7,"n_rows":33,"n_cols":10,"rows_kept":33,"cut":false,"hidden":true,"merged":[[6,2,6,3],[7,6,31,6],[7,7,31,7],[0,12,0,13],[1,7,1,9],[2,1,2,2],[2,4,2,5],[2,7,2,9],[4,1,5,1],[4,8,5,8],[4,9,5,9],[5,2,5,7]]}
[]
[null,"1. Name of Airspace:",null,null,{"$f":"\"2a. Partial or complete description of \"&B3&\":\"","v":"2a. Partial or complete description of :"},null,null,{"$f":"IF(E3=\"Partial\",\"2b. Please describe parts of \"&B3&\" not included in this entry, therefore assumed unchanged:\",\"2b. N/A\")","v":"2b. N/A"}]
[]
[]
[null,"\n\n\n\n\n","ENR 5.1 PROHIBITED, RESTRICTED AND DANGER AREAS (Including RU)",null,null,null,null,null,{"$f":"\"A total of \"&COUNTIF(I8:I32,\"Yes\")","v":"A total of 0"}]
[null,null,"Only one named airspace per worksheet - additional sheets are added via the Content and Approval tab. "]
[null,"Select points below in publication order (Origin North/West & Clockwise)",{"$f":"\"Identification and Name\nLateral Limits\n\n\"&B3","v":"Identification and Name\nLateral Limits\n\n"},null,"Optional 1.\nTextual description to describe join type. Great circle line assumed if blank","Optional 2. Radius of arc","Upper Limit\nLower Limit","Remarks\n(time of activity, type of restriction, nature of hazard, risk of interception)","CAA\nissues to resolve?","Additional CAA Comments"]
[null,null,{"$f":"IF(B8=\"\",\"\",IFERROR(VLOOKUP($B8,'Latitude & Longitude'!$B$5:$L$1001,7,FALSE),\"No Change\"))","v":""},{"$f":"IF(B8=\"\",\"\",IFERROR(VLOOKUP($B8,'Latitude & Longitude'!$B$5:$L$1001,11,FALSE),\"No Change\"))","v":""}]
[null,null,{"$f":"IF(B9=\"\",\"\",IFERROR(VLOOKUP($B9,'Latitude & Longitude'!$B$5:$L$1001,7,FALSE),\"No Change\"))","v":""},{"$f":"IF(B9=\"\",\"\",IFERROR(VLOOKUP($B9,'Latitude & Longitude'!$B$5:$L$1001,11,FALSE),\"No Change\"))","v":""}]
[null,null,{"$f":"IF(B10=\"\",\"\",IFERROR(VLOOKUP($B10,'Latitude & Longitude'!$B$5:$L$1001,7,FALSE),\"No Change\"))","v":""},{"$f":"IF(B10=\"\",\"\",IFERROR(VLOOKUP($B10,'Latitude & Longitude'!$B$5:$L$1001,11,FALSE),\"No Change\"))","v":""}]
[null,null,{"$f":"IF(B11=\"\",\"\",IFERROR(VLOOKUP($B11,'Latitude & Longitude'!$B$5:$L$1001,7,FALSE),\"No Change\"))","v":""},{"$f":"IF(B11=\"\",\"\",IFERROR(VLOOKUP($B11,'Latitude & Longitude'!$B$5:$L$1001,11,FALSE),\"No Change\"))","v":""}]
[null,null,{"$f":"IF(B12=\"\",\"\",IFERROR(VLOOKUP($B12,'Latitude & Longitude'!$B$5:$L$1001,7,FALSE),\"No Change\"))","v":""},{"$f":"IF(B12=\"\",\"\",IFERROR(VLOOKUP($B12,'Latitude & Longitude'!$B$5:$L$1001,11,FALSE),\"No Change\"))","v":""}]
[null,null,{"$f":"IF(B13=\"\",\"\",IFERROR(VLOOKUP($B13,'Latitude & Longitude'!$B$5:$L$1001,7,FALSE),\"No Change\"))","v":""},{"$f":"IF(B13=\"\",\"\",IFERROR(VLOOKUP($B13,'Latitude & Longitude'!$B$5:$L$1001,11,FALSE),\"No Change\"))","v":""}]
[null,null,{"$f":"IF(B14=\"\",\"\",IFERROR(VLOOKUP($B14,'Latitude & Longitude'!$B$5:$L$1001,7,FALSE),\"No Change\"))","v":""},{"$f":"IF(B14=\"\",\"\",IFERROR(VLOOKUP($B14,'Latitude & Longitude'!$B$5:$L$1001,11,FALSE),\"No Change\"))","v":""}]
[null,null,{"$f":"IF(B15=\"\",\"\",IFERROR(VLOOKUP($B15,'Latitude & Longitude'!$B$5:$L$1001,7,FALSE),\"No Change\"))","v":""},{"$f":"IF(B15=\"\",\"\",IFERROR(VLOOKUP($B15,'Latitude & Longitude'!$B$5:$L$1001,11,FALSE),\"No Change\"))","v":""}]
[null,null,{"$f":"IF(B16=\"\",\"\",IFERROR(VLOOKUP($B16,'Latitude & Longitude'!$B$5:$L$1001,7,FALSE),\"No Change\"))","v":""},{"$f":"IF(B16=\"\",\"\",IFERROR(VLOOKUP($B16,'Latitude & Longitude'!$B$5:$L$1001,11,FALSE),\"No Change\"))","v":""}]
[null,null,{"$f":"IF(B17=\"\",\"\",IFERROR(VLOOKUP($B17,'Latitude & Longitude'!$B$5:$L$1001,7,FALSE),\"No Change\"))","v":""},{"$f":"IF(B17=\"\",\"\",IFERROR(VLOOKUP($B17,'Latitude & Longitude'!$B$5:$L$1001,11,FALSE),\"No Change\"))","v":""}]
[null,null,{"$f":"IF(B18=\"\",\"\",IFERROR(VLOOKUP($B18,'Latitude & Longitude'!$B$5:$L$1001,7,FALSE),\"No Change\"))","v":""},{"$f":"IF(B18=\"\",\"\",IFERROR(VLOOKUP($B18,'Latitude & Longitude'!$B$5:$L$1001,11,FALSE),\"No Change\"))","v":""}]
[null,null,{"$f":"IF(B19=\"\",\"\",IFERROR(VLOOKUP($B19,'Latitude & Longitude'!$B$5:$L$1001,7,FALSE),\"No Change\"))","v":""},{"$f":"IF(B19=\"\",\"\",IFERROR(VLOOKUP($B19,'Latitude & Longitude'!$B$5:$L$1001,11,FALSE),\"No Change\"))","v":""}]
[null,null,{"$f":"IF(B20=\"\",\"\",IFERROR(VLOOKUP($B20,'Latitude & Longitude'!$B$5:$L$1001,7,FALSE),\"No Change\"))","v":""},{"$f":"IF(B20=\"\",\"\",IFERROR(VLOOKUP($B20,'Latitude & Longitude'!$B$5:$L$1001,11,FALSE),\"No Change\"))","v":""}]
[null,null,{"$f":"IF(B21=\"\",\"\",IFERROR(VLOOKUP($B21,'Latitude & Longitude'!$B$5:$L$1001,7,FALSE),\"No Change\"))","v":""},{"$f":"IF(B21=\"\",\"\",IFERROR(VLOOKUP($B21,'Latitude & Longitude'!$B$5:$L$1001,11,FALSE),\"No Change\"))","v":""}]
[null,null,{"$f":"IF(B22=\"\",\"\",IFERROR(VLOOKUP($B22,'Latitude & Longitude'!$B$5:$L$1001,7,FALSE),\"No Change\"))","v":""},{"$f":"IF(B22=\"\",\"\",IFERROR(VLOOKUP($B22,'Latitude & Longitude'!$B$5:$L$1001,11,FALSE),\"No Change\"))","v":""}]
[null,null,{"$f":"IF(B23=\"\",\"\",IFERROR(VLOOKUP($B23,'Latitude & Longitude'!$B$5:$L$1001,7,FALSE),\"No Change\"))","v":""},{"$f":"IF(B23=\"\",\"\",IFERROR(VLOOKUP($B23,'Latitude & Longitude'!$B$5:$L$1001,11,FALSE),\"No Change\"))","v":""}]
[null,null,{"$f":"IF(B24=\"\",\"\",IFERROR(VLOOKUP($B24,'Latitude & Longitude'!$B$5:$L$1001,7,FALSE),\"No Change\"))","v":""},{"$f":"IF(B24=\"\",\"\",IFERROR(VLOOKUP($B24,'Latitude & Longitude'!$B$5:$L$1001,11,FALSE),\"No Change\"))","v":""}]
[null,null,{"$f":"IF(B25=\"\",\"\",IFERROR(VLOOKUP($B25,'Latitude & Longitude'!$B$5:$L$1001,7,FALSE),\"No Change\"))","v":""},{"$f":"IF(B25=\"\",\"\",IFERROR(VLOOKUP($B25,'Latitude & Longitude'!$B$5:$L$1001,11,FALSE),\"No Change\"))","v":""}]
[null,null,{"$f":"IF(B26=\"\",\"\",IFERROR(VLOOKUP($B26,'Latitude & Longitude'!$B$5:$L$1001,7,FALSE),\"No Change\"))","v":""},{"$f":"IF(B26=\"\",\"\",IFERROR(VLOOKUP($B26,'Latitude & Longitude'!$B$5:$L$1001,11,FALSE),\"No Change\"))","v":""}]
[null,null,{"$f":"IF(B27=\"\",\"\",IFERROR(VLOOKUP($B27,'Latitude & Longitude'!$B$5:$L$1001,7,FALSE),\"No Change\"))","v":""},{"$f":"IF(B27=\"\",\"\",IFERROR(VLOOKUP($B27,'Latitude & Longitude'!$B$5:$L$1001,11,FALSE),\"No Change\"))","v":""}]
[null,null,{"$f":"IF(B28=\"\",\"\",IFERROR(VLOOKUP($B28,'Latitude & Longitude'!$B$5:$L$1001,7,FALSE),\"No Change\"))","v":""},{"$f":"IF(B28=\"\",\"\",IFERROR(VLOOKUP($B28,'Latitude & Longitude'!$B$5:$L$1001,11,FALSE),\"No Change\"))","v":""}]
[null,null,{"$f":"IF(B29=\"\",\"\",IFERROR(VLOOKUP($B29,'Latitude & Longitude'!$B$5:$L$1001,7,FALSE),\"No Change\"))","v":""},{"$f":"IF(B29=\"\",\"\",IFERROR(VLOOKUP($B29,'Latitude & Longitude'!$B$5:$L$1001,11,FALSE),\"No Change\"))","v":""}]
[null,null,{"$f":"IF(B30=\"\",\"\",IFERROR(VLOOKUP($B30,'Latitude & Longitude'!$B$5:$L$1001,7,FALSE),\"No Change\"))","v":""},{"$f":"IF(B30=\"\",\"\",IFERROR(VLOOKUP($B30,'Latitude & Longitude'!$B$5:$L$1001,11,FALSE),\"No Change\"))","v":""}]
[null,null,{"$f":"IF(B31=\"\",\"\",IFERROR(VLOOKUP($B31,'Latitude & Longitude'!$B$5:$L$1001,7,FALSE),\"No Change\"))","v":""},{"$f":"IF(B31=\"\",\"\",IFERROR(VLOOKUP($B31,'Latitude & Longitude'!$B$5:$L$1001,11,FALSE),\"No Change\"))","v":""}]
[null,null,{"$f":"IF(B32=\"\",\"\",IFERROR(VLOOKUP($B32,'Latitude & Longitude'!$B$5:$L$1001,7,FALSE),\"No Change\"))","v":""},{"$f":"IF(B32=\"\",\"\",IFERROR(VLOOKUP($B32,'Latitude & Longitude'!$B$5:$L$1001,11,FALSE),\"No Change\"))","v":""}]
[null,"< Click '+' for more rows"]

{"sheet":"AD 2.17 Temp","index":8,"n_rows":33,"n_cols":14,"rows_kept":33,"cut":false,"hidden":true,"merged":[[7,11,31,11],[6,2,6,3],[7,6,31,6],[7,7,31,7],[7,8,31,8],[7,9,31,9],[7,10,31,10],[1,7,1,13],[2,1,2,2],[2,4,2,5],[2,7,2,13],[4,1,5,1],[4,12,5,12],[4,13,5,13]]}
[]
[null,"1. Name of Airspace:",null,null,{"$f":"\"2a. Partial or complete description of \"&B3&\":\"","v":"2a. Partial or complete description of :"},null,null,{"$f":"IF(E3=\"Partial\",\"2b. Please describe parts of \"&B3&\" not included in this entry, therefore assumed unchanged:\",\"2b. N/A\")","v":"2b. N/A"}]
[]
[]
[null,"\n\n\n\n\n","AD 2.17 AIR TRAFFIC SERVICES AIRSPACE",null,null,null,null,null,null,null,null,null,{"$f":"\"A total of \"&COUNTIF(M8:M32,\"Yes\")","v":"A total of 0"}]
[null,null,"Only one named airspace per worksheet - additional sheets are added via the Content and Approval tab. "]
[null,"Select points below in publication order (Origin North/West & Clockwise)",{"$f":"\"Designation and lateral limits\n\n\n\"&B3","v":"Designation and lateral limits\n\n\n"},null,"Optional 1.\nTextual description to describe join type. Great circle line assumed if blank","Optional 2. Radius of arc","Vertical Limits","Airspace Class","ATS unit callsign/language","Transition\nAltitude","Hours of Applicability","Remarks","CAA\nissues to resolve?","\nAdditional CAA Comments"]
[null,null,{"$f":"IF(B8=\"\",\"\",IFERROR(VLOOKUP($B8,'Latitude & Longitude'!$B$5:$L$1001,7,FALSE),\"No Change\"))","v":""},{"$f":"IF(B8=\"\",\"\",IFERROR(VLOOKUP($B8,'Latitude & Longitude'!$B$5:$L$1001,11,FALSE),\"No Change\"))","v":""}]
[null,null,{"$f":"IF(B9=\"\",\"\",IFERROR(VLOOKUP($B9,'Latitude & Longitude'!$B$5:$L$1001,7,FALSE),\"No Change\"))","v":""},{"$f":"IF(B9=\"\",\"\",IFERROR(VLOOKUP($B9,'Latitude & Longitude'!$B$5:$L$1001,11,FALSE),\"No Change\"))","v":""}]
[null,null,{"$f":"IF(B10=\"\",\"\",IFERROR(VLOOKUP($B10,'Latitude & Longitude'!$B$5:$L$1001,7,FALSE),\"No Change\"))","v":""},{"$f":"IF(B10=\"\",\"\",IFERROR(VLOOKUP($B10,'Latitude & Longitude'!$B$5:$L$1001,11,FALSE),\"No Change\"))","v":""}]
[null,null,{"$f":"IF(B11=\"\",\"\",IFERROR(VLOOKUP($B11,'Latitude & Longitude'!$B$5:$L$1001,7,FALSE),\"No Change\"))","v":""},{"$f":"IF(B11=\"\",\"\",IFERROR(VLOOKUP($B11,'Latitude & Longitude'!$B$5:$L$1001,11,FALSE),\"No Change\"))","v":""}]
[null,null,{"$f":"IF(B12=\"\",\"\",IFERROR(VLOOKUP($B12,'Latitude & Longitude'!$B$5:$L$1001,7,FALSE),\"No Change\"))","v":""},{"$f":"IF(B12=\"\",\"\",IFERROR(VLOOKUP($B12,'Latitude & Longitude'!$B$5:$L$1001,11,FALSE),\"No Change\"))","v":""}]
[null,null,{"$f":"IF(B13=\"\",\"\",IFERROR(VLOOKUP($B13,'Latitude & Longitude'!$B$5:$L$1001,7,FALSE),\"No Change\"))","v":""},{"$f":"IF(B13=\"\",\"\",IFERROR(VLOOKUP($B13,'Latitude & Longitude'!$B$5:$L$1001,11,FALSE),\"No Change\"))","v":""}]
[null,null,{"$f":"IF(B14=\"\",\"\",IFERROR(VLOOKUP($B14,'Latitude & Longitude'!$B$5:$L$1001,7,FALSE),\"No Change\"))","v":""},{"$f":"IF(B14=\"\",\"\",IFERROR(VLOOKUP($B14,'Latitude & Longitude'!$B$5:$L$1001,11,FALSE),\"No Change\"))","v":""}]
[null,null,{"$f":"IF(B15=\"\",\"\",IFERROR(VLOOKUP($B15,'Latitude & Longitude'!$B$5:$L$1001,7,FALSE),\"No Change\"))","v":""},{"$f":"IF(B15=\"\",\"\",IFERROR(VLOOKUP($B15,'Latitude & Longitude'!$B$5:$L$1001,11,FALSE),\"No Change\"))","v":""}]
[null,null,{"$f":"IF(B16=\"\",\"\",IFERROR(VLOOKUP($B16,'Latitude & Longitude'!$B$5:$L$1001,7,FALSE),\"No Change\"))","v":""},{"$f":"IF(B16=\"\",\"\",IFERROR(VLOOKUP($B16,'Latitude & Longitude'!$B$5:$L$1001,11,FALSE),\"No Change\"))","v":""}]
[null,null,{"$f":"IF(B17=\"\",\"\",IFERROR(VLOOKUP($B17,'Latitude & Longitude'!$B$5:$L$1001,7,FALSE),\"No Change\"))","v":""},{"$f":"IF(B17=\"\",\"\",IFERROR(VLOOKUP($B17,'Latitude & Longitude'!$B$5:$L$1001,11,FALSE),\"No Change\"))","v":""}]
[null,null,{"$f":"IF(B18=\"\",\"\",IFERROR(VLOOKUP($B18,'Latitude & Longitude'!$B$5:$L$1001,7,FALSE),\"No Change\"))","v":""},{"$f":"IF(B18=\"\",\"\",IFERROR(VLOOKUP($B18,'Latitude & Longitude'!$B$5:$L$1001,11,FALSE),\"No Change\"))","v":""}]
[null,null,{"$f":"IF(B19=\"\",\"\",IFERROR(VLOOKUP($B19,'Latitude & Longitude'!$B$5:$L$1001,7,FALSE),\"No Change\"))","v":""},{"$f":"IF(B19=\"\",\"\",IFERROR(VLOOKUP($B19,'Latitude & Longitude'!$B$5:$L$1001,11,FALSE),\"No Change\"))","v":""}]
[null,null,{"$f":"IF(B20=\"\",\"\",IFERROR(VLOOKUP($B20,'Latitude & Longitude'!$B$5:$L$1001,7,FALSE),\"No Change\"))","v":""},{"$f":"IF(B20=\"\",\"\",IFERROR(VLOOKUP($B20,'Latitude & Longitude'!$B$5:$L$1001,11,FALSE),\"No Change\"))","v":""}]
[null,null,{"$f":"IF(B21=\"\",\"\",IFERROR(VLOOKUP($B21,'Latitude & Longitude'!$B$5:$L$1001,7,FALSE),\"No Change\"))","v":""},{"$f":"IF(B21=\"\",\"\",IFERROR(VLOOKUP($B21,'Latitude & Longitude'!$B$5:$L$1001,11,FALSE),\"No Change\"))","v":""}]
[null,null,{"$f":"IF(B22=\"\",\"\",IFERROR(VLOOKUP($B22,'Latitude & Longitude'!$B$5:$L$1001,7,FALSE),\"No Change\"))","v":""},{"$f":"IF(B22=\"\",\"\",IFERROR(VLOOKUP($B22,'Latitude & Longitude'!$B$5:$L$1001,11,FALSE),\"No Change\"))","v":""}]
[null,null,{"$f":"IF(B23=\"\",\"\",IFERROR(VLOOKUP($B23,'Latitude & Longitude'!$B$5:$L$1001,7,FALSE),\"No Change\"))","v":""},{"$f":"IF(B23=\"\",\"\",IFERROR(VLOOKUP($B23,'Latitude & Longitude'!$B$5:$L$1001,11,FALSE),\"No Change\"))","v":""}]
[null,null,{"$f":"IF(B24=\"\",\"\",IFERROR(VLOOKUP($B24,'Latitude & Longitude'!$B$5:$L$1001,7,FALSE),\"No Change\"))","v":""},{"$f":"IF(B24=\"\",\"\",IFERROR(VLOOKUP($B24,'Latitude & Longitude'!$B$5:$L$1001,11,FALSE),\"No Change\"))","v":""}]
[null,null,{"$f":"IF(B25=\"\",\"\",IFERROR(VLOOKUP($B25,'Latitude & Longitude'!$B$5:$L$1001,7,FALSE),\"No Change\"))","v":""},{"$f":"IF(B25=\"\",\"\",IFERROR(VLOOKUP($B25,'Latitude & Longitude'!$B$5:$L$1001,11,FALSE),\"No Change\"))","v":""}]
[null,null,{"$f":"IF(B26=\"\",\"\",IFERROR(VLOOKUP($B26,'Latitude & Longitude'!$B$5:$L$1001,7,FALSE),\"No Change\"))","v":""},{"$f":"IF(B26=\"\",\"\",IFERROR(VLOOKUP($B26,'Latitude & Longitude'!$B$5:$L$1001,11,FALSE),\"No Change\"))","v":""}]
[null,null,{"$f":"IF(B27=\"\",\"\",IFERROR(VLOOKUP($B27,'Latitude & Longitude'!$B$5:$L$1001,7,FALSE),\"No Change\"))","v":""},{"$f":"IF(B27=\"\",\"\",IFERROR(VLOOKUP($B27,'Latitude & Longitude'!$B$5:$L$1001,11,FALSE),\"No Change\"))","v":""}]
[null,null,{"$f":"IF(B28=\"\",\"\",IFERROR(VLOOKUP($B28,'Latitude & Longitude'!$B$5:$L$1001,7,FALSE),\"No Change\"))","v":""},{"$f":"IF(B28=\"\",\"\",IFERROR(VLOOKUP($B28,'Latitude & Longitude'!$B$5:$L$1001,11,FALSE),\"No Change\"))","v":""}]
[null,null,{"$f":"IF(B29=\"\",\"\",IFERROR(VLOOKUP($B29,'Latitude & Longitude'!$B$5:$L$1001,7,FALSE),\"No Change\"))","v":""},{"$f":"IF(B29=\"\",\"\",IFERROR(VLOOKUP($B29,'Latitude & Longitude'!$B$5:$L$1001,11,FALSE),\"No Change\"))","v":""}]
[null,null,{"$f":"IF(B30=\"\",\"\",IFERROR(VLOOKUP($B30,'Latitude & Longitude'!$B$5:$L$1001,7,FALSE),\"No Change\"))","v":""},{"$f":"IF(B30=\"\",\"\",IFERROR(VLOOKUP($B30,'Latitude & Longitude'!$B$5:$L$1001,11,FALSE),\"No Change\"))","v":""}]
[null,null,{"$f":"IF(B31=\"\",\"\",IFERROR(VLOOKUP($B31,'Latitude & Longitude'!$B$5:$L$1001,7,FALSE),\"No Change\"))","v":""},{"$f":"IF(B31=\"\",\"\",IFERROR(VLOOKUP($B31,'Latitude & Longitude'!$B$5:$L$1001,11,FALSE),\"No Change\"))","v":""}]
[null,null,{"$f":"IF(B32=\"\",\"\",IFERROR(VLOOKUP($B32,'Latitude & Longitude'!$B$5:$L$1001,7,FALSE),\"No Change\"))","v":""},{"$f":"IF(B32=\"\",\"\",IFERROR(VLOOKUP($B32,'Latitude & Longitude'!$B$5:$L$1001,11,FALSE),\"No Change\"))","v":""}]
[null,"< Click '+' for more rows"]

{"sheet":"Other Airspace Temp","index":9,"n_rows":58,"n_cols":12,"rows_kept":58,"cut":false,"hidden":true,"merged":[[4,1,5,1],[4,10,5,10],[4,11,5,11],[6,2,6,3],[7,6,54,6],[7,7,54,7],[7,8,54,8],[7,9,54,9],[1,1,1,3],[1,10,1,12],[2,1,2,3],[2,4,2,5],[2,7,2,9],[2,10,2,11]]}
[]
[null,"1a. AIP section or method of promulgation",null,null,"1b. Name of Airspace or Route:",null,null,{"$f":"\"2a. Partial or complete description of \"&E3&\":\"","v":"2a. Partial or complete description of :"},null,null,{"$f":"IF(H3=\"Partial\",\"2b. Describe parts of \"&E3&\" not included in this entry (therefore assumed unchanged):\",\"2b. N/A\")","v":"2b. N/A"}]
[]
[]
[null,"\n\n\n\n\n",{"$f":"\"Other Airspace - \"&B3","v":"Other Airspace - "},null,null,null,null,null,null,null,{"$f":"\"A total of \"&COUNTIF(K8:K55,\"Yes\")","v":"A total of 0"}]
[null,null,"Only one named airspace per worksheet - additional sheets are added via the Content and Approval tab. "]
[null,"Select points below in publication order (Origin North/West & Clockwise)",{"$f":"\"Designation and lateral limits\n\n\n\"&E3","v":"Designation and lateral limits\n\n\n"},null,"Optional 1.\nTextual description to describe join type. Great circle line assumed if blank","Optional 2. Radius of arc","Column Heading 1\n(Rename)","Column Heading 2\n(Rename)","Column Heading 3\n(Rename)","Column Heading 4\n(Rename)","CAA\nissues to resolve?","Additional CAA Comments"]
[null,null,{"$f":"IF(B8=\"\",\"\",IFERROR(VLOOKUP($B8,'Latitude & Longitude'!$B$5:$L$1001,7,FALSE),\"No Change\"))","v":""},{"$f":"IF(B8=\"\",\"\",IFERROR(VLOOKUP($B8,'Latitude & Longitude'!$B$5:$L$1001,11,FALSE),\"No Change\"))","v":""}]
[null,null,{"$f":"IF(B9=\"\",\"\",IFERROR(VLOOKUP($B9,'Latitude & Longitude'!$B$5:$L$1001,7,FALSE),\"No Change\"))","v":""},{"$f":"IF(B9=\"\",\"\",IFERROR(VLOOKUP($B9,'Latitude & Longitude'!$B$5:$L$1001,11,FALSE),\"No Change\"))","v":""}]
[null,null,{"$f":"IF(B10=\"\",\"\",IFERROR(VLOOKUP($B10,'Latitude & Longitude'!$B$5:$L$1001,7,FALSE),\"No Change\"))","v":""},{"$f":"IF(B10=\"\",\"\",IFERROR(VLOOKUP($B10,'Latitude & Longitude'!$B$5:$L$1001,11,FALSE),\"No Change\"))","v":""}]
[null,null,{"$f":"IF(B11=\"\",\"\",IFERROR(VLOOKUP($B11,'Latitude & Longitude'!$B$5:$L$1001,7,FALSE),\"No Change\"))","v":""},{"$f":"IF(B11=\"\",\"\",IFERROR(VLOOKUP($B11,'Latitude & Longitude'!$B$5:$L$1001,11,FALSE),\"No Change\"))","v":""}]
[null,null,{"$f":"IF(B12=\"\",\"\",IFERROR(VLOOKUP($B12,'Latitude & Longitude'!$B$5:$L$1001,7,FALSE),\"No Change\"))","v":""},{"$f":"IF(B12=\"\",\"\",IFERROR(VLOOKUP($B12,'Latitude & Longitude'!$B$5:$L$1001,11,FALSE),\"No Change\"))","v":""}]
[null,null,{"$f":"IF(B13=\"\",\"\",IFERROR(VLOOKUP($B13,'Latitude & Longitude'!$B$5:$L$1001,7,FALSE),\"No Change\"))","v":""},{"$f":"IF(B13=\"\",\"\",IFERROR(VLOOKUP($B13,'Latitude & Longitude'!$B$5:$L$1001,11,FALSE),\"No Change\"))","v":""}]
[null,null,{"$f":"IF(B14=\"\",\"\",IFERROR(VLOOKUP($B14,'Latitude & Longitude'!$B$5:$L$1001,7,FALSE),\"No Change\"))","v":""},{"$f":"IF(B14=\"\",\"\",IFERROR(VLOOKUP($B14,'Latitude & Longitude'!$B$5:$L$1001,11,FALSE),\"No Change\"))","v":""}]
[null,null,{"$f":"IF(B15=\"\",\"\",IFERROR(VLOOKUP($B15,'Latitude & Longitude'!$B$5:$L$1001,7,FALSE),\"No Change\"))","v":""},{"$f":"IF(B15=\"\",\"\",IFERROR(VLOOKUP($B15,'Latitude & Longitude'!$B$5:$L$1001,11,FALSE),\"No Change\"))","v":""}]
[null,null,{"$f":"IF(B16=\"\",\"\",IFERROR(VLOOKUP($B16,'Latitude & Longitude'!$B$5:$L$1001,7,FALSE),\"No Change\"))","v":""},{"$f":"IF(B16=\"\",\"\",IFERROR(VLOOKUP($B16,'Latitude & Longitude'!$B$5:$L$1001,11,FALSE),\"No Change\"))","v":""}]
[null,null,{"$f":"IF(B17=\"\",\"\",IFERROR(VLOOKUP($B17,'Latitude & Longitude'!$B$5:$L$1001,7,FALSE),\"No Change\"))","v":""},{"$f":"IF(B17=\"\",\"\",IFERROR(VLOOKUP($B17,'Latitude & Longitude'!$B$5:$L$1001,11,FALSE),\"No Change\"))","v":""}]
[null,null,{"$f":"IF(B18=\"\",\"\",IFERROR(VLOOKUP($B18,'Latitude & Longitude'!$B$5:$L$1001,7,FALSE),\"No Change\"))","v":""},{"$f":"IF(B18=\"\",\"\",IFERROR(VLOOKUP($B18,'Latitude & Longitude'!$B$5:$L$1001,11,FALSE),\"No Change\"))","v":""}]
[null,null,{"$f":"IF(B19=\"\",\"\",IFERROR(VLOOKUP($B19,'Latitude & Longitude'!$B$5:$L$1001,7,FALSE),\"No Change\"))","v":""},{"$f":"IF(B19=\"\",\"\",IFERROR(VLOOKUP($B19,'Latitude & Longitude'!$B$5:$L$1001,11,FALSE),\"No Change\"))","v":""}]
[null,null,{"$f":"IF(B20=\"\",\"\",IFERROR(VLOOKUP($B20,'Latitude & Longitude'!$B$5:$L$1001,7,FALSE),\"No Change\"))","v":""},{"$f":"IF(B20=\"\",\"\",IFERROR(VLOOKUP($B20,'Latitude & Longitude'!$B$5:$L$1001,11,FALSE),\"No Change\"))","v":""}]
[null,null,{"$f":"IF(B21=\"\",\"\",IFERROR(VLOOKUP($B21,'Latitude & Longitude'!$B$5:$L$1001,7,FALSE),\"No Change\"))","v":""},{"$f":"IF(B21=\"\",\"\",IFERROR(VLOOKUP($B21,'Latitude & Longitude'!$B$5:$L$1001,11,FALSE),\"No Change\"))","v":""}]
[null,null,{"$f":"IF(B22=\"\",\"\",IFERROR(VLOOKUP($B22,'Latitude & Longitude'!$B$5:$L$1001,7,FALSE),\"No Change\"))","v":""},{"$f":"IF(B22=\"\",\"\",IFERROR(VLOOKUP($B22,'Latitude & Longitude'!$B$5:$L$1001,11,FALSE),\"No Change\"))","v":""}]
[null,null,{"$f":"IF(B23=\"\",\"\",IFERROR(VLOOKUP($B23,'Latitude & Longitude'!$B$5:$L$1001,7,FALSE),\"No Change\"))","v":""},{"$f":"IF(B23=\"\",\"\",IFERROR(VLOOKUP($B23,'Latitude & Longitude'!$B$5:$L$1001,11,FALSE),\"No Change\"))","v":""}]
[null,null,{"$f":"IF(B24=\"\",\"\",IFERROR(VLOOKUP($B24,'Latitude & Longitude'!$B$5:$L$1001,7,FALSE),\"No Change\"))","v":""},{"$f":"IF(B24=\"\",\"\",IFERROR(VLOOKUP($B24,'Latitude & Longitude'!$B$5:$L$1001,11,FALSE),\"No Change\"))","v":""}]
[null,null,{"$f":"IF(B25=\"\",\"\",IFERROR(VLOOKUP($B25,'Latitude & Longitude'!$B$5:$L$1001,7,FALSE),\"No Change\"))","v":""},{"$f":"IF(B25=\"\",\"\",IFERROR(VLOOKUP($B25,'Latitude & Longitude'!$B$5:$L$1001,11,FALSE),\"No Change\"))","v":""}]
[null,null,{"$f":"IF(B26=\"\",\"\",IFERROR(VLOOKUP($B26,'Latitude & Longitude'!$B$5:$L$1001,7,FALSE),\"No Change\"))","v":""},{"$f":"IF(B26=\"\",\"\",IFERROR(VLOOKUP($B26,'Latitude & Longitude'!$B$5:$L$1001,11,FALSE),\"No Change\"))","v":""}]
[null,null,{"$f":"IF(B27=\"\",\"\",IFERROR(VLOOKUP($B27,'Latitude & Longitude'!$B$5:$L$1001,7,FALSE),\"No Change\"))","v":""},{"$f":"IF(B27=\"\",\"\",IFERROR(VLOOKUP($B27,'Latitude & Longitude'!$B$5:$L$1001,11,FALSE),\"No Change\"))","v":""}]
[null,null,{"$f":"IF(B28=\"\",\"\",IFERROR(VLOOKUP($B28,'Latitude & Longitude'!$B$5:$L$1001,7,FALSE),\"No Change\"))","v":""},{"$f":"IF(B28=\"\",\"\",IFERROR(VLOOKUP($B28,'Latitude & Longitude'!$B$5:$L$1001,11,FALSE),\"No Change\"))","v":""}]
[null,null,{"$f":"IF(B29=\"\",\"\",IFERROR(VLOOKUP($B29,'Latitude & Longitude'!$B$5:$L$1001,7,FALSE),\"No Change\"))","v":""},{"$f":"IF(B29=\"\",\"\",IFERROR(VLOOKUP($B29,'Latitude & Longitude'!$B$5:$L$1001,11,FALSE),\"No Change\"))","v":""}]
[null,null,{"$f":"IF(B30=\"\",\"\",IFERROR(VLOOKUP($B30,'Latitude & Longitude'!$B$5:$L$1001,7,FALSE),\"No Change\"))","v":""},{"$f":"IF(B30=\"\",\"\",IFERROR(VLOOKUP($B30,'Latitude & Longitude'!$B$5:$L$1001,11,FALSE),\"No Change\"))","v":""}]
[null,null,{"$f":"IF(B31=\"\",\"\",IFERROR(VLOOKUP($B31,'Latitude & Longitude'!$B$5:$L$1001,7,FALSE),\"No Change\"))","v":""},{"$f":"IF(B31=\"\",\"\",IFERROR(VLOOKUP($B31,'Latitude & Longitude'!$B$5:$L$1001,11,FALSE),\"No Change\"))","v":""}]
[null,null,{"$f":"IF(B32=\"\",\"\",IFERROR(VLOOKUP($B32,'Latitude & Longitude'!$B$5:$L$1001,7,FALSE),\"No Change\"))","v":""},{"$f":"IF(B32=\"\",\"\",IFERROR(VLOOKUP($B32,'Latitude & Longitude'!$B$5:$L$1001,11,FALSE),\"No Change\"))","v":""}]
[null,null,{"$f":"IF(B33=\"\",\"\",IFERROR(VLOOKUP($B33,'Latitude & Longitude'!$B$5:$L$1001,7,FALSE),\"No Change\"))","v":""},{"$f":"IF(B33=\"\",\"\",IFERROR(VLOOKUP($B33,'Latitude & Longitude'!$B$5:$L$1001,11,FALSE),\"No Change\"))","v":""}]
[null,null,{"$f":"IF(B34=\"\",\"\",IFERROR(VLOOKUP($B34,'Latitude & Longitude'!$B$5:$L$1001,7,FALSE),\"No Change\"))","v":""},{"$f":"IF(B34=\"\",\"\",IFERROR(VLOOKUP($B34,'Latitude & Longitude'!$B$5:$L$1001,11,FALSE),\"No Change\"))","v":""}]
[null,null,{"$f":"IF(B35=\"\",\"\",IFERROR(VLOOKUP($B35,'Latitude & Longitude'!$B$5:$L$1001,7,FALSE),\"No Change\"))","v":""},{"$f":"IF(B35=\"\",\"\",IFERROR(VLOOKUP($B35,'Latitude & Longitude'!$B$5:$L$1001,11,FALSE),\"No Change\"))","v":""}]
[null,null,{"$f":"IF(B36=\"\",\"\",IFERROR(VLOOKUP($B36,'Latitude & Longitude'!$B$5:$L$1001,7,FALSE),\"No Change\"))","v":""},{"$f":"IF(B36=\"\",\"\",IFERROR(VLOOKUP($B36,'Latitude & Longitude'!$B$5:$L$1001,11,FALSE),\"No Change\"))","v":""}]
[null,null,{"$f":"IF(B37=\"\",\"\",IFERROR(VLOOKUP($B37,'Latitude & Longitude'!$B$5:$L$1001,7,FALSE),\"No Change\"))","v":""},{"$f":"IF(B37=\"\",\"\",IFERROR(VLOOKUP($B37,'Latitude & Longitude'!$B$5:$L$1001,11,FALSE),\"No Change\"))","v":""}]
[null,null,{"$f":"IF(B38=\"\",\"\",IFERROR(VLOOKUP($B38,'Latitude & Longitude'!$B$5:$L$1001,7,FALSE),\"No Change\"))","v":""},{"$f":"IF(B38=\"\",\"\",IFERROR(VLOOKUP($B38,'Latitude & Longitude'!$B$5:$L$1001,11,FALSE),\"No Change\"))","v":""}]
[null,null,{"$f":"IF(B39=\"\",\"\",IFERROR(VLOOKUP($B39,'Latitude & Longitude'!$B$5:$L$1001,7,FALSE),\"No Change\"))","v":""},{"$f":"IF(B39=\"\",\"\",IFERROR(VLOOKUP($B39,'Latitude & Longitude'!$B$5:$L$1001,11,FALSE),\"No Change\"))","v":""}]
[null,null,{"$f":"IF(B40=\"\",\"\",IFERROR(VLOOKUP($B40,'Latitude & Longitude'!$B$5:$L$1001,7,FALSE),\"No Change\"))","v":""},{"$f":"IF(B40=\"\",\"\",IFERROR(VLOOKUP($B40,'Latitude & Longitude'!$B$5:$L$1001,11,FALSE),\"No Change\"))","v":""}]
[null,null,{"$f":"IF(B41=\"\",\"\",IFERROR(VLOOKUP($B41,'Latitude & Longitude'!$B$5:$L$1001,7,FALSE),\"No Change\"))","v":""},{"$f":"IF(B41=\"\",\"\",IFERROR(VLOOKUP($B41,'Latitude & Longitude'!$B$5:$L$1001,11,FALSE),\"No Change\"))","v":""}]
[null,null,{"$f":"IF(B42=\"\",\"\",IFERROR(VLOOKUP($B42,'Latitude & Longitude'!$B$5:$L$1001,7,FALSE),\"No Change\"))","v":""},{"$f":"IF(B42=\"\",\"\",IFERROR(VLOOKUP($B42,'Latitude & Longitude'!$B$5:$L$1001,11,FALSE),\"No Change\"))","v":""}]
[null,null,{"$f":"IF(B43=\"\",\"\",IFERROR(VLOOKUP($B43,'Latitude & Longitude'!$B$5:$L$1001,7,FALSE),\"No Change\"))","v":""},{"$f":"IF(B43=\"\",\"\",IFERROR(VLOOKUP($B43,'Latitude & Longitude'!$B$5:$L$1001,11,FALSE),\"No Change\"))","v":""}]
[null,null,{"$f":"IF(B44=\"\",\"\",IFERROR(VLOOKUP($B44,'Latitude & Longitude'!$B$5:$L$1001,7,FALSE),\"No Change\"))","v":""},{"$f":"IF(B44=\"\",\"\",IFERROR(VLOOKUP($B44,'Latitude & Longitude'!$B$5:$L$1001,11,FALSE),\"No Change\"))","v":""}]
[null,null,{"$f":"IF(B45=\"\",\"\",IFERROR(VLOOKUP($B45,'Latitude & Longitude'!$B$5:$L$1001,7,FALSE),\"No Change\"))","v":""},{"$f":"IF(B45=\"\",\"\",IFERROR(VLOOKUP($B45,'Latitude & Longitude'!$B$5:$L$1001,11,FALSE),\"No Change\"))","v":""}]
[null,null,{"$f":"IF(B46=\"\",\"\",IFERROR(VLOOKUP($B46,'Latitude & Longitude'!$B$5:$L$1001,7,FALSE),\"No Change\"))","v":""},{"$f":"IF(B46=\"\",\"\",IFERROR(VLOOKUP($B46,'Latitude & Longitude'!$B$5:$L$1001,11,FALSE),\"No Change\"))","v":""}]
[null,null,{"$f":"IF(B47=\"\",\"\",IFERROR(VLOOKUP($B47,'Latitude & Longitude'!$B$5:$L$1001,7,FALSE),\"No Change\"))","v":""},{"$f":"IF(B47=\"\",\"\",IFERROR(VLOOKUP($B47,'Latitude & Longitude'!$B$5:$L$1001,11,FALSE),\"No Change\"))","v":""}]
[null,null,{"$f":"IF(B48=\"\",\"\",IFERROR(VLOOKUP($B48,'Latitude & Longitude'!$B$5:$L$1001,7,FALSE),\"No Change\"))","v":""},{"$f":"IF(B48=\"\",\"\",IFERROR(VLOOKUP($B48,'Latitude & Longitude'!$B$5:$L$1001,11,FALSE),\"No Change\"))","v":""}]
[null,null,{"$f":"IF(B49=\"\",\"\",IFERROR(VLOOKUP($B49,'Latitude & Longitude'!$B$5:$L$1001,7,FALSE),\"No Change\"))","v":""},{"$f":"IF(B49=\"\",\"\",IFERROR(VLOOKUP($B49,'Latitude & Longitude'!$B$5:$L$1001,11,FALSE),\"No Change\"))","v":""}]
[null,null,{"$f":"IF(B50=\"\",\"\",IFERROR(VLOOKUP($B50,'Latitude & Longitude'!$B$5:$L$1001,7,FALSE),\"No Change\"))","v":""},{"$f":"IF(B50=\"\",\"\",IFERROR(VLOOKUP($B50,'Latitude & Longitude'!$B$5:$L$1001,11,FALSE),\"No Change\"))","v":""}]
[null,null,{"$f":"IF(B51=\"\",\"\",IFERROR(VLOOKUP($B51,'Latitude & Longitude'!$B$5:$L$1001,7,FALSE),\"No Change\"))","v":""},{"$f":"IF(B51=\"\",\"\",IFERROR(VLOOKUP($B51,'Latitude & Longitude'!$B$5:$L$1001,11,FALSE),\"No Change\"))","v":""}]
[null,null,{"$f":"IF(B52=\"\",\"\",IFERROR(VLOOKUP($B52,'Latitude & Longitude'!$B$5:$L$1001,7,FALSE),\"No Change\"))","v":""},{"$f":"IF(B52=\"\",\"\",IFERROR(VLOOKUP($B52,'Latitude & Longitude'!$B$5:$L$1001,11,FALSE),\"No Change\"))","v":""}]
[null,null,{"$f":"IF(B53=\"\",\"\",IFERROR(VLOOKUP($B53,'Latitude & Longitude'!$B$5:$L$1001,7,FALSE),\"No Change\"))","v":""},{"$f":"IF(B53=\"\",\"\",IFERROR(VLOOKUP($B53,'Latitude & Longitude'!$B$5:$L$1001,11,FALSE),\"No Change\"))","v":""}]
[null,null,{"$f":"IF(B54=\"\",\"\",IFERROR(VLOOKUP($B54,'Latitude & Longitude'!$B$5:$L$1001,7,FALSE),\"No Change\"))","v":""},{"$f":"IF(B54=\"\",\"\",IFERROR(VLOOKUP($B54,'Latitude & Longitude'!$B$5:$L$1001,11,FALSE),\"No Change\"))","v":""}]
[null,null,{"$f":"IF(B55=\"\",\"\",IFERROR(VLOOKUP($B55,'Latitude & Longitude'!$B$5:$L$1001,7,FALSE),\"No Change\"))","v":""},{"$f":"IF(B55=\"\",\"\",IFERROR(VLOOKUP($B55,'Latitude & Longitude'!$B$5:$L$1001,11,FALSE),\"No Change\"))","v":""}]
[null,"< Click '+' for more rows","Upper Limit:"]
[null,null,"Lower Limit:"]
[null,null,"Class:"]

{"sheet":"Metadata","index":10,"n_rows":63,"n_cols":15,"rows_kept":63,"cut":false,"hidden":false,"merged":[[62,4,62,7],[12,6,12,7],[11,6,11,7],[34,4,34,7],[7,4,7,7],[19,4,19,7],[14,2,15,2],[20,2,21,2],[48,2,49,2],[29,9,30,9],[44,8,45,8],[14,8,15,8],[44,9,45,9],[38,9,39,9],[44,2,45,2],[8,1,14,1],[20,1,29,1],[35,1,61,1],[23,2,24,2],[8,9,9,9],[14,9,15,9],[11,9,12,9],[53,2,60,2],[41,2,42,2],[26,2,27,2],[29,2,30,2],[35,2,36,2],[38,2,39,2],[11,8,12,8],[8,2,9,2],[11,2,12,2],[8,11,14,11],[20,11,29,11],[35,11,61,11],[26,8,27,8],[23,8,24,8],[20,8,21,8],[20,9,21,9],[23,9,24,9],[26,9,27,9],[35,8,36,8],[35,9,36,9],[29,8,30,8],[8,8,9,8],[41,8,42,8],[41,9,42,9],[38,8,39,8],[1,9,3,9],[1,8,3,8],[1,3,1,7],[2,3,2,7],[3,3,3,7],[6,3,6,7],[0,7,0,8],[5,1,5,3],[5,4,5,7],[4,4,4,7]]}
[]
[null,null,null,null,null,null,null,null,{"$f":"\"A total of \"&COUNTIF(I4:I63,\"Yes\")","v":"A total of 0"},null,null,null,3,"Level 1 ACP","A change to the notified airspace design that has the potential for a high impact on aviation and/or non-aviation stakeholders….. Section 1, 2 & 3 of metadata are required."]
[null,null,null,{"$f":"\"Metadata relating to \"&'Content & Approval'!C9","v":"Metadata relating to My Airspace Project "},null,null,null,null,null,null,null,null,3,"Level 2 ACP","A change to the notified airspace design that has the potential for a medium impact on aviation and/or non-aviation stakeholders….. Section 1, 2 & 3 of metadata are required."]
[null,null,null,"Required for CAP 1616 project data bound for the AIP (See CAP 1054 Annex A). Complete all cells marked with *",null,null,null,null,null,null,null,null,3,"Level 3 ACP (with geodetic calculations)","A change to the notified airspace design that has the potential for a low impact on both aviation and non-aviation stakeholders. New geodetic data is included in the submission….. Section 1, 2 & 3 of metadata are required."]
[null,"Select the ACP Level/Type Below:",null,null,{"$f":"IF(B6=\"\",\"\",\"A generic summary of the ACP Level & ADQ metadata requirements are below:\")","v":""},null,null,null,{"$f":"COUNTIF(I9:I63,\"Yes\")","v":0},null,null,null,2,"Level 3 ACP (no geodetic calculations)","A change to the notified airspace design that has the potential for a low impact on both aviation and non-aviation stakeholders. No new geodetic data is included in the submission….. Section 1 & 2 only of metadata are required."]
[null,null,null,null,{"$f":"IF(B6=N2,O2,IF(B6=N3,O3,IF(B6=N4,O4,IF(B6=N5,O5,IF(B6=N6,O6,\"\")))))","v":""},null,null,null,"CAA issues to resolve?","Additional CAA Comments",null,null,0,"ICARD 5LNC/IFP Waypoints","No metadata required for this provisional approval. Should the 5LNC/s be incorporated within routes published in the AIP at a later stage of this project, metadata will then be required."]
[{"$f":"'Latitude & Longitude'!F1","v":0},{"$f":"'Latitude & Longitude'!F1&Metadata!B6","v":""},null,{"$f":"IF(B7=\"YESOther Change to Airspace (NOT Airspace Design)\",\"ERROR - you have selected NOT Airspace Design but new calculated geodetics are included in the LAT/LONG sheet\",\"\")","v":""}]
[{"$f":"IF(E10=\"\",\"1\",IF(G10=\"\",\"1\",IF(H10=\"\",\"1\",IF(E13=\"\",\"1\",IF(F13=\"\",\"1\",IF(G13=\"\",\"1\",IF(E16=\"\",\"1\",IF(F16=\"\",\"1\",IF(G16=\"\",\"1\",IF(H16=\"\",\"1\",\"0\"))))))))))","v":"1"},null,null,{"$f":"IF(B6=\"\",\"\",IF(B6=N2,\"Please complete this section:\",IF(B6=N3,\"Please complete this section:\",IF(B6=N4,\"Please complete this section:\",IF(B6=N5,\"Please complete this section:\",IF(B6=N6,\"Not Required\"))))))","v":""},{"$f":"IF(D8=\"\",\"\",IF(D8=\"Not Required\",\"\",IF(A8=\"1\",\"Additional input required in Section 1 to meet the requirements of ADQ\",\"Minimum content achieved for Section 1\")))","v":""},null,null,null,{"$f":"IF(D8=\"\",\"\",IF(D8=\"Not Required\",\"\",IF(A8=\"1\",\"r\",\"a\")))","v":""}]
[null,"1. PROJECT",null,"1a. Project Details >","*DAP 1916 reference","DAP 1917 Ref (If applicable):","*Requested Effective Date","*CAA case officer",null,null,null,"1. PROJECT"]
[]
[]
[null,null,null,"1b. Aero Data Version Details >","This submitted version No.",{"$f":"\"*Version \"&'Content & Approval'!E9& \".0 Submission date:\"","v":"*Version 1.0 Submission date:"},{"$f":"\"*Brief summary of new content in version \"&'Content & Approval'!E9& \".0:\"","v":"*Brief summary of new content in version 1.0:"}]
[null,null,null,null,{"$f":"'Content & Approval'!E9","v":1}]
[]
[null,null,null,"1c. Authorised Source of Change >","*Name of organisation","*Quality standard type","*Quality standard date","*Nominated quality manager"]
[]
[]
[]
[]
[{"$f":"IF(E22=\"\",\"1\",IF(F22=\"\",\"1\",IF(G22=\"\",\"1\",IF(H22=\"\",\"1\",IF(E25=\"\",\"1\",IF(F25=\"\",\"1\",IF(G25=\"\",\"1\",IF(H25=\"\",\"1\",IF(E28=\"\",\"1\",IF(F28=\"\",\"1\",IF(G28=\"\",\"1\",IF(H28=\"\",\"1\",IF(E31=\"\",\"1\",IF(G31=\"\",\"1\",IF(H31=\"\",\"1\",\"0\")))))))))))))))","v":"0"},null,null,{"$f":"IF(B6=\"\",\"\",IF(B6=N2,\"Please check default values:\",IF(B6=N3,\"Please check default values:\",IF(B6=N4,\"Please check default values:\",IF(B6=N5,\"Please check default values:\",IF(B6=N6,\"Not Required\"))))))","v":""},{"$f":"IF(D20=\"\",\"\",IF(D20=\"Not Required\",\"\",IF(A20=\"1\",\"Additional input required in Section 2 to meet the requirements of ADQ\",\"Minimum content achieved for Section 2\")))","v":""},null,null,null,{"$f":"IF(D20=\"\",\"\",IF(D20=\"Not Required\",\"\",IF(A20=\"1\",\"r\",\"a\")))","v":""}]
[null,"2. DATA STANDARDS",null,"2a. Lateral Data >","*Ellipsoid","*Reference frame"," *Distance unit","*Route unit",null,null,null,"2. DATA STANDARDS"]
[null,null,null,null,"WGS84","ETRF2014","NM (Unless otherwise Indicated)","Degrees True"]
[]
[null,null,null,"2b. Coordinate format >","*Latitudinal units","*Hemispherical Suffix","*Longitudinal units","*Meridian suffix"]
[null,null,null,null,"DegMinSec.Sec  DDMMSS.ss","N","DegMinSec.Sec  DDDMMSS.ss","E or W as specified"]
[]
[null,null,null,"2c. Vertical Data >","*Based on","*Reference frame for sea level","*Data unit","*Limit type"]
[null,null,null,null,"AMSL  (Unless Indicated)","OSGM15 (Newlyn Datum)","Feet (Unless Indicated)","At, Lower/Upper as Indicated"]
[]
[null,null,null,"2d. General Data >","*Temporal type",{"$f":"IF(E31=\"Permanent\",\"Intentionally Blank\",\"End date:\")","v":"Intentionally Blank"},"*Data Storage Location","*Data retention period"]
[null,null,null,null,"Permanent",null,"As per current QMS","indefinite"]
[]
[]
[]
[{"$f":"IF(E37=\"\",\"1\",IF(E40=\"\",\"1\",IF(F40=\"\",\"1\",IF(G40=\"\",\"1\",IF(H40=\"\",\"1\",IF(E43=\"\",\"1\",IF(F43=\"\",\"1\",IF(G43=\"\",\"1\",IF(H43=\"\",\"1\",IF(E49=\"\",\"1\",IF(E50=\"\",\"1\",IF(F49=\"\",\"1\",IF(F50=\"\",\"1\",IF(E54=\"\",\"1\",IF(E55=\"\",\"1\",IF(E56=\"\",\"1\",IF(E57=\"\",\"1\",IF(E58=\"\",\"1\",IF(E59=\"\",\"1\",IF(E60=\"\",\"1\",IF(E61=\"\",\"1\",IF(E63=\"\",\"1\",\"0\"))))))))))))))))))))))","v":"1"},null,null,{"$f":"IF(B6=\"\",\"\",IF(B6=N2,\"Please complete this section:\",IF(B6=N3,\"Please complete this section:\",IF(B6=N4,\"Please complete this section:\",IF(B6=N5,\"Not Required\",IF(B6=N6,\"Not Required\"))))))","v":""},{"$f":"IF(D35=\"\",\"\",IF(D35=\"Not Required\",\"\",IF(A35=\"1\",\"Additional input required in Section 3 to meet the requirements of ADQ\",\"Minimum content achieved for Section 3\")))","v":""},null,null,null,{"$f":"IF(D35=\"\",\"\",IF(D35=\"Not Required\",\"\",IF(A35=\"1\",\"r\",\"a\")))","v":""}]
[null,"3. AIRSPACE DESIGN",null,"3a. Formal Arrangement (FA) >","*FA has been signed?",{"$f":"IF(E37=\"Yes\",\"Authorised Source Signatory\",\"N/A\")","v":"N/A"},{"$f":"IF(E37=\"Yes\",\"Airspace Designer Signatory\",\"N/A\")","v":"N/A"},{"$f":"IF(E37=\"Yes\",\"FA Date\",\"N/A\")","v":"N/A"},null,null,null,"3. AIRSPACE DESIGN"]
[null,null,null,"Authorised Source / Airspace Designer:"]
[]
[null,null,null,"3b. Airspace Design Content >","*Name of organisation","*Quality standard type","*Quality standard date","*Nominated quality manager"]
[null,null,null,"Organisation:"]
[]
[null,null,null,"3c. Airspace Design Content >","*Airspace Design Originator","*Origination date","*Name of compliance checker","*Compliance check date"]
[null,null,null,"Individuals:"]
[]
[null,null,null,"3d. Airspace Design Content >","Geodetic Originator","Name of compliance checker","Calculation Tools","ADQ compliant source data?"]
[null,null,null,"Geodetic Calculations (if applicable):"]
[]
[null,null,null,"3e. Key Airspace Design Criteria >","*Airspace Design Criteria 1","*Airspace Design Criteria 2","Airspace Design Criteria 3","Airspace Desing Criteria 4"]
[null,null,null,"Document:","CAP 1616 Airspace Design","Aeronautical Data Policy"]
[null,null,null,"Version Dated:"]
[]
[]
[null,null,null,{"$f":"IF(OR(B6=N3,B6=N4),\"No Details Required\",\"3f. Data Sources >\")","v":"3f. Data Sources >"},"*Data Source 1","Data Source 2","Data Source 3","Data Source 4"]
[null,null,null,"*Data Source Name:","Current UK AIP Data"]
[null,null,null,"*Data Source Originator:","NATS AIS"]
[null,null,null,"*Valid From Date:"]
[null,null,null,"*Validation & Verification method:"]
[null,null,null,"*Validated & Verified by (name):"]
[null,null,null,"*Amend/Convert/Transform method:","None"]
[null,null,null,"*Amend/Convert/Transform by (name):","None"]
[null,null,null,"*Limitations on data use:","None"]
[]
[null,null,null,{"$f":"IF(OR(B6=N3,B6=N4),\"No Details Required\",\"*Summary of Design Rationale, Assumptions & Contraints\")","v":"*Summary of Design Rationale, Assumptions & Contraints"},"For details please see the full ACP package as submitted to Airspace Regulation."]